Currently running tests

Click on the package name to jump to the currently running tests of that package.

apport boost1.62 cross-toolchain-base
fdroidserver fenics ganeti
libreoffice linux mshr
nemo nova open-iscsi
openjdk-lts openssh resource-agents
snapcraft snapd systemd-upstream
xen-tools

Queue lengths

Click on the number in a cell to jump to the list of test requests for that release and architecture which are waiting to be run.

ubuntu amd64arm64armhfi386ppc64els390x
precise - - - - - -
trusty - - - - - -
vivid - - - - - -
xenial - - - - - -
yakkety - - - - - -
zesty - - - - - -
artful - - - - - -
bionic - - - - - -
cosmic - - - - - -
disco - - - - - -
huge amd64arm64armhfi386ppc64els390x
precise - - - - - -
trusty - - - - - -
vivid - - - - - -
xenial - - - - - -
yakkety - - - - - -
zesty - - - - - -
artful - - - - - -
bionic - - - - - -
cosmic - - - - - -
disco - - - - - -
ppa amd64arm64armhfi386ppc64els390x
precise - - - - - -
trusty - - - - - -
vivid - - - - - -
xenial - - - - - -
yakkety - - - - - -
zesty - - - - - -
artful - - - - - -
bionic - - - - - -
cosmic - - - - - -
disco - - - - - -
upstream amd64arm64armhfi386ppc64els390x
precise - - - - - -
trusty - - - - - -
vivid - - - - - -
xenial - - - - - -
yakkety - - - - - -
zesty - - - - - -
artful - - - - - -
bionic - 11 - - - -
cosmic - - - - - -
disco - - - - - -

apport

Release:cosmic
Architecture:armhf
Triggers:['gvfs/1.38.1-0ubuntu1']
Running for:1h 18m 35s
  File "./test_report.py", line 694, in test_add_gdb_info_script
    self._validate_core(coredump)
  File "./test_report.py", line 569, in _validate_core
    assert os.path.exists(core_path)
AssertionError

During handling of the above exception, another exception occurred:

Traceback (most recent call last):
  File "./test_report.py", line 702, in test_add_gdb_info_script
    os.unlink(coredump)
FileNotFoundError: [Errno 2] No such file or directory: '/tmp/core'

======================================================================
FAIL: test_add_zz_parse_segv_details (__main__.T)
parse-segv produces sensible results
----------------------------------------------------------------------
Traceback (most recent call last):
  File "./test_report.py", line 672, in test_add_zz_parse_segv_details
    self.assertIn('not located in a known VMA region', pr['SegvAnalysis'])
AssertionError: 'not located in a known VMA region' not found in 'Skipped: missing required field "ProcMaps"'

----------------------------------------------------------------------
Ran 39 tests in 57.237s

FAILED (failures=1, errors=2)
--- Testing rethread ---
test_exc_raise (__main__.T)
exc_raise() raises caught thread exception. ... ok
test_exc_raise_complex (__main__.T)
exceptions that can't be simply created are reraised correctly ... ok
test_exception (__main__.T)
exception in thread is caught and passed. ... ok
test_no_return_value (__main__.T)
apport.REThread.REThread works if run() does not return anything. ... ok
test_return_value (__main__.T)
return value works properly. ... --- Testing signal_crashes ---
ok

----------------------------------------------------------------------
Ran 5 tests in 0.512s

OK
test_core_dump_packaged (__main__.T)
packaged executables create core dumps on proper ulimits ... FAIL
test_core_dump_unpackaged (__main__.T)
unpackaged executables create core dumps on proper ulimits ... FAIL
test_core_file_injection (__main__.T)
cannot inject core file ... 
        
Release:bionic
Architecture:armhf
Triggers:['gvfs/1.36.1-0ubuntu1.2']
Running for:1h 2m 14s
  File "./test_report.py", line 694, in test_add_gdb_info_script
    self._validate_core(coredump)
  File "./test_report.py", line 569, in _validate_core
    assert os.path.exists(core_path)
AssertionError

During handling of the above exception, another exception occurred:

Traceback (most recent call last):
  File "./test_report.py", line 702, in test_add_gdb_info_script
    os.unlink(coredump)
FileNotFoundError: [Errno 2] No such file or directory: '/tmp/core'

======================================================================
FAIL: test_add_zz_parse_segv_details (__main__.T)
parse-segv produces sensible results
----------------------------------------------------------------------
Traceback (most recent call last):
  File "./test_report.py", line 672, in test_add_zz_parse_segv_details
    self.assertIn('not located in a known VMA region', pr['SegvAnalysis'])
AssertionError: 'not located in a known VMA region' not found in 'Skipped: missing required field "ProcMaps"'

----------------------------------------------------------------------
Ran 39 tests in 66.195s

FAILED (failures=1, errors=2)
--- Testing rethread ---
test_exc_raise (__main__.T)
exc_raise() raises caught thread exception. ... ok
test_exc_raise_complex (__main__.T)
exceptions that can't be simply created are reraised correctly ... ok
test_exception (__main__.T)
exception in thread is caught and passed. ... ok
test_no_return_value (__main__.T)
apport.REThread.REThread works if run() does not return anything. ... ok
test_return_value (__main__.T)
return value works properly. ... ok

----------------------------------------------------------------------
Ran 5 tests in 0.524s

OK
--- Testing signal_crashes ---
test_core_dump_packaged (__main__.T)
packaged executables create core dumps on proper ulimits ... FAIL
test_core_dump_unpackaged (__main__.T)
unpackaged executables create core dumps on proper ulimits ... FAIL
test_core_file_injection (__main__.T)
cannot inject core file ... 
        

boost1.62

Release:disco
Architecture:i386
Triggers:['boost-defaults/1.67.0.1']
Running for:3h 3m 0s
[ 50%] Linking CXX executable demo1
[ 50%] Built target demo1
Scanning dependencies of target demo2
[ 75%] Building CXX object CMakeFiles/demo2.dir/demo2.cpp.o
[100%] Linking CXX executable demo2
[100%] Built target demo2
build: OK
[2018-11-20 19:36:46.525673] [0xb79a1700] [trace]   A trace severity message
[2018-11-20 19:36:46.525748] [0xb79a1700] [debug]   A debug severity message
[2018-11-20 19:36:46.525764] [0xb79a1700] [info]    An informational severity message
[2018-11-20 19:36:46.525779] [0xb79a1700] [warning] A warning severity message
[2018-11-20 19:36:46.525794] [0xb79a1700] [error]   An error severity message
[2018-11-20 19:36:46.525809] [0xb79a1700] [fatal]   A fatal severity message
run: demo1 OK
total 2664
-rw-rw-r-- 1 ubuntu ubuntu   17332 Nov 20 19:36 CMakeCache.txt
drwxrwxr-x 7 ubuntu ubuntu    4096 Nov 20 19:36 CMakeFiles
-rw-rw-r-- 1 ubuntu ubuntu    5731 Nov 20 19:36 Makefile
-rw-rw-r-- 1 ubuntu ubuntu    1494 Nov 20 19:36 cmake_install.cmake
-rwxrwxr-x 1 ubuntu ubuntu   43324 Nov 20 19:36 demo1
-rwxrwxr-x 1 ubuntu ubuntu 1335080 Nov 20 19:36 demo2
-rw-rw-r-- 1 ubuntu ubuntu 1306670 Nov 20 19:36 test.log
0: [2018-Nov-20 19:36:46.533646] [b71c1b40] - Log record 0
1: [2018-Nov-20 19:36:46.533735] [b71c1b40] - Log record 1
2: [2018-Nov-20 19:36:46.533767] [b71c1b40] - Log record 2
3: [2018-Nov-20 19:36:46.533793] [b71c1b40] - Log record 3
4: [2018-Nov-20 19:36:46.533816] [b71c1b40] - Log record 4
5: [2018-Nov-20 19:36:46.533843] [b71c1b40] - Log record 5
6: [2018-Nov-20 19:36:46.533867] [b71c1b40] - Log record 6
7: [2018-Nov-20 19:36:46.533891] [b71c1b40] - Log record 7
8: [2018-Nov-20 19:36:46.533914] [b71c1b40] - Log record 8
9: [2018-Nov-20 19:36:46.533950] [b71c1b40] - Log record 9
run: demo2 OK
autopkgtest [19:36:51]: test log: -----------------------]
autopkgtest [19:36:51]: test log:  - - - - - - - - - - results - - - - - - - - - -
log                  PASS
autopkgtest [19:36:51]: test math: preparing testbed

        

cross-toolchain-base

Release:disco
Architecture:arm64
Triggers:['tar/1.30+dfsg-3']
Running for:5h 29m 41s
arm-linux-gnueabihf-gcc-8 -no-pie -fno-PIE xpipe.c -c -std=gnu11 -fgnu89-inline  -O2 -Wall -Werror -Wundef -Wwrite-strings -fmerge-all-constants -frounding-math -fstack-protector-strong -g -pipe -Wstrict-prototypes -Wold-style-definition -fno-math-errno    -fPIC      -U_FORTIFY_SOURCE -isystem /tmp/autopkgtest.9ID8Lx/build.8Zq/src/glibc-2.28/debian/include  -I../include -I/tmp/autopkgtest.9ID8Lx/build.8Zq/src/glibc-2.28/build-tree/armhf-libc/support  -I/tmp/autopkgtest.9ID8Lx/build.8Zq/src/glibc-2.28/build-tree/armhf-libc  -I../sysdeps/unix/sysv/linux/arm  -I../sysdeps/arm/nptl  -I../sysdeps/unix/sysv/linux/include -I../sysdeps/unix/sysv/linux  -I../sysdeps/nptl  -I../sysdeps/pthread  -I../sysdeps/gnu  -I../sysdeps/unix/inet  -I../sysdeps/unix/sysv  -I../sysdeps/unix/arm  -I../sysdeps/unix  -I../sysdeps/posix  -I../sysdeps/arm/armv7/multiarch  -I../sysdeps/arm/armv7  -I../sysdeps/arm/armv6t2  -I../sysdeps/arm/armv6  -I../sysdeps/arm/include -I../sysdeps/arm  -I../sysdeps/wordsize-32  -I../sysdeps/ieee754/flt-32  -I../sysdeps/ieee754/dbl-64  -I../sysdeps/ieee754  -I../sysdeps/generic  -I.. -I../libio -I. -nostdinc -isystem /tmp/autopkgtest.9ID8Lx/build.8Zq/src/debian/tmp.armhf/usr/bin/../lib/gcc-cross/arm-linux-gnueabihf/8/include -isystem /tmp/autopkgtest.9ID8Lx/build.8Zq/src/debian/tmp.armhf/usr/bin/../lib/gcc-cross/arm-linux-gnueabihf/8/include-fixed -isystem /tmp/autopkgtest.9ID8Lx/build.8Zq/src/glibc-2.28/debian/include  -D_LIBC_REENTRANT -include /tmp/autopkgtest.9ID8Lx/build.8Zq/src/glibc-2.28/build-tree/armhf-libc/libc-modules.h -DMODULE_NAME=libsupport -include ../include/libc-symbols.h   -DPIC -DLIBC_NONSHARED=1     -DTOP_NAMESPACE=glibc -o /tmp/autopkgtest.9ID8Lx/build.8Zq/src/glibc-2.28/build-tree/armhf-libc/support/xpipe.oS -MD -MP -MF /tmp/autopkgtest.9ID8Lx/build.8Zq/src/glibc-2.28/build-tree/armhf-libc/support/xpipe.oS.dt -MT /tmp/autopkgtest.9ID8Lx/build.8Zq/src/glibc-2.28/build-tree/armhf-libc/support/xpipe.oS

        

fdroidserver

Release:bionic
Architecture:amd64
Triggers:['openjdk-lts/10.0.2+13-1ubuntu0.18.04.4']
Ppas:['ubuntu-security-proposed/ppa']
Running for:1h 3m 52s

Re-run jarsigner with the -verbose option for more details.

ERROR: JAR signature failed to verify: repo/org.bitbucket.tickytacky.mirrormirror_2.apk

The jar will be treated as unsigned, because it is signed with a weak algorithm that is now disabled.

Re-run jarsigner with the -verbose option for more details.

ERROR: JAR signature failed to verify: repo/org.bitbucket.tickytacky.mirrormirror_3.apk

The jar will be treated as unsigned, because it is signed with a weak algorithm that is now disabled.

Re-run jarsigner with the -verbose option for more details.

ERROR: JAR signature failed to verify: repo/org.bitbucket.tickytacky.mirrormirror_4.apk

The jar will be treated as unsigned, because it is signed with a weak algorithm that is now disabled.

Re-run jarsigner with the -verbose option for more details.

WARNING: repo/urzip-badsig.apk is set to android:debuggable="true"
ERROR: JAR signature failed to verify: repo/urzip-badsig.apk
jarsigner: java.lang.SecurityException: invalid SHA1 signature file digest for AndroidManifest.xml

ERROR: Old APK signature failed to verify: repo/urzip-badsig.apk
jarsigner: java.lang.SecurityException: invalid SHA1 signature file digest for AndroidManifest.xml

WARNING: Archiving urzip-badsig.apk with invalid signature!
INFO: Moving urzip-badsig.apk from repo to archive
WARNING: archive/urzip-badsig.apk is set to android:debuggable="true"
ERROR: JAR signature failed to verify: archive/urzip-badsig.apk
jarsigner: java.lang.SecurityException: invalid SHA1 signature file digest for AndroidManifest.xml

ERROR: Old APK signature failed to verify: archive/urzip-badsig.apk
jarsigner: java.lang.SecurityException: invalid SHA1 signature file digest for AndroidManifest.xml

WARNING: Archiving urzip-badsig.apk with invalid signature!
INFO: Moving com.politedroid_3.apk from repo to archive
INFO: Moving org.bitbucket.tickytacky.mirrormirror_1.apk from repo to archive
INFO: Creating unsigned index in preparation for signing

        

fenics

Release:disco
Architecture:arm64
Triggers:['dolfin/2018.1.0.post1-12build1']
Requester:ginggs
Running for:0h 7m 0s
Selecting previously unselected package libspooles-dev:arm64.
Preparing to unpack .../148-libspooles-dev_2.2-13_arm64.deb ...
Unpacking libspooles-dev:arm64 (2.2-13) ...
Selecting previously unselected package libsuperlu-dev:arm64.
Preparing to unpack .../149-libsuperlu-dev_5.2.1+dfsg1-3build1_arm64.deb ...
Unpacking libsuperlu-dev:arm64 (5.2.1+dfsg1-3build1) ...
Selecting previously unselected package libhypre-dev:arm64.
Preparing to unpack .../150-libhypre-dev_2.14.0-5build1_arm64.deb ...
Unpacking libhypre-dev:arm64 (2.14.0-5build1) ...
Selecting previously unselected package libptscotch-dev.
Preparing to unpack .../151-libptscotch-dev_6.0.6-2_arm64.deb ...
Unpacking libptscotch-dev (6.0.6-2) ...
Selecting previously unselected package libscalapack-openmpi-dev.
Preparing to unpack .../152-libscalapack-openmpi-dev_2.0.2-7build2_arm64.deb ...
Unpacking libscalapack-openmpi-dev (2.0.2-7build2) ...
Selecting previously unselected package libscalapack-mpi-dev.
Preparing to unpack .../153-libscalapack-mpi-dev_2.0.2-7build2_arm64.deb ...
Unpacking libscalapack-mpi-dev (2.0.2-7build2) ...
Selecting previously unselected package libmumps-dev:arm64.
Preparing to unpack .../154-libmumps-dev_5.1.2-4build2_arm64.deb ...
Unpacking libmumps-dev:arm64 (5.1.2-4build2) ...
Selecting previously unselected package libfftw3-bin.
Preparing to unpack .../155-libfftw3-bin_3.3.8-2_arm64.deb ...
Unpacking libfftw3-bin (3.3.8-2) ...
Selecting previously unselected package libfftw3-dev:arm64.
Preparing to unpack .../156-libfftw3-dev_3.3.8-2_arm64.deb ...
Unpacking libfftw3-dev:arm64 (3.3.8-2) ...
Selecting previously unselected package libfftw3-mpi-dev:arm64.
Preparing to unpack .../157-libfftw3-mpi-dev_3.3.8-2_arm64.deb ...
Unpacking libfftw3-mpi-dev:arm64 (3.3.8-2) ...
Selecting previously unselected package libssl-dev:arm64.
Preparing to unpack .../158-libssl-dev_1.1.1-1ubuntu2_arm64.deb ...
Unpacking libssl-dev:arm64 (1.1.1-1ubuntu2) ...

        

ganeti

Release:cosmic
Architecture:i386
Triggers:['openssh/1:7.7p1-4ubuntu0.1']
Running for:0h 43m 41s
Preparing to unpack .../openssh-sftp-server_1%3a7.7p1-4ubuntu0.1_i386.deb ...
Unpacking openssh-sftp-server (1:7.7p1-4ubuntu0.1) over (1:7.7p1-4) ...
Preparing to unpack .../openssh-server_1%3a7.7p1-4ubuntu0.1_i386.deb ...
Unpacking openssh-server (1:7.7p1-4ubuntu0.1) over (1:7.7p1-4) ...
Preparing to unpack .../openssh-client_1%3a7.7p1-4ubuntu0.1_i386.deb ...
Unpacking openssh-client (1:7.7p1-4ubuntu0.1) over (1:7.7p1-4) ...
Preparing to unpack .../linux-firmware_1.175.1_all.deb ...
Unpacking linux-firmware (1.175.1) over (1.175) ...
Processing triggers for ufw (0.35-6) ...
Setting up libelf1:i386 (0.170-0.5.0ubuntu1) ...
Processing triggers for libc-bin (2.28-0ubuntu1) ...
Setting up udev (239-7ubuntu10.4) ...
update-initramfs: deferring update (trigger activated)
Setting up systemd (239-7ubuntu10.4) ...
Processing triggers for man-db (2.8.4-2) ...
Processing triggers for dbus (1.12.10-1ubuntu2) ...
Setting up openssh-client (1:7.7p1-4ubuntu0.1) ...
Setting up linux-firmware (1.175.1) ...
update-initramfs: Generating /boot/initrd.img-4.18.0-11-generic
Setting up libnss-systemd:i386 (239-7ubuntu10.4) ...
Setting up systemd-sysv (239-7ubuntu10.4) ...
Setting up openssh-sftp-server (1:7.7p1-4ubuntu0.1) ...
Setting up libpam-systemd:i386 (239-7ubuntu10.4) ...
Setting up openssh-server (1:7.7p1-4ubuntu0.1) ...
rescue-ssh.target is a disabled or a static unit, not starting it.
Processing triggers for initramfs-tools (0.131ubuntu15) ...
update-initramfs: Generating /boot/initrd.img-4.18.0-11-generic
Processing triggers for libc-bin (2.28-0ubuntu1) ...
autopkgtest [19:37:43]: rebooting testbed after setup commands that affected boot
Exit request sent.
autopkgtest-virt-ssh: WARNING: ssh connection failed. Retrying in 3 seconds...
autopkgtest-virt-ssh: WARNING: ssh connection failed. Retrying in 3 seconds...
autopkgtest-virt-ssh: WARNING: ssh connection failed. Retrying in 3 seconds...

        

libreoffice

Release:disco
Architecture:armhf
Triggers:['pango1.0/1.42.4-4']
Running for:3h 54m 44s
Setting up fontconfig (2.13.0-5ubuntu3) ...
Regenerating fonts cache... done.
Setting up libavahi-common-data:armhf (0.7-4ubuntu3) ...
Setting up libwebp6:armhf (0.6.1-2) ...
Setting up libjpeg8:armhf (8c-2ubuntu8) ...
Setting up liblangtag1:armhf (0.6.2-1) ...
Setting up libboost-filesystem1.67.0:armhf (1.67.0-9) ...
Setting up libexttextcat-2.0-0:armhf (3.4.5-1) ...
Setting up libcurl3-gnutls:armhf (7.61.0-1ubuntu2) ...
Setting up libboost-thread1.67.0:armhf (1.67.0-9) ...
Setting up libnss3:armhf (2:3.36.1-1ubuntu1) ...
Setting up libharfbuzz0b:armhf (2.1.1-1) ...
Setting up libtiff5:armhf (4.0.9+git181026-1) ...
Setting up libpoppler79:armhf (0.68.0-0ubuntu1) ...
Setting up libice6:armhf (2:1.0.9-2) ...
Setting up libavahi-common3:armhf (0.7-4ubuntu3) ...
Setting up ure (6.1.3-0ubuntu2) ...
Setting up liborcus-0.13-0:armhf (0.14.0+really0.13.4-1) ...
Setting up libxmlsec1-nss:armhf (1.2.26-3) ...
Setting up libboost-locale1.67.0:armhf (1.67.0-9) ...
Setting up libsm6:armhf (2:1.2.2-1) ...
Setting up libraptor2-0:armhf (2.0.14-1build1) ...
Setting up libcmis-0.5-5v5 (0.5.1+git20160603-3build3) ...
Setting up libharfbuzz-icu0:armhf (2.1.1-1) ...
Setting up librasqal3:armhf (0.9.32-1build1) ...
Setting up libavahi-client3:armhf (0.7-4ubuntu3) ...
Setting up librdf0:armhf (1.0.17-1.1) ...
Setting up libcups2:armhf (2.2.8-5ubuntu1) ...
Setting up libreoffice-style-tango (1:6.1.3-0ubuntu2) ...
Setting up libreoffice-style-colibre (1:6.1.3-0ubuntu2) ...
Setting up libreoffice-common (1:6.1.3-0ubuntu2) ...
Setting up libreoffice-core (1:6.1.3-0ubuntu2) ...
Setting up libreoffice-dev-common (1:6.1.3-0ubuntu2) ...
Setting up libreoffice-dev (1:6.1.3-0ubuntu2) ...
Setting up autopkgtest-satdep (0) ...
Processing triggers for libc-bin (2.28-0ubuntu1) ...
Processing triggers for systemd (239-7ubuntu10) ...
(Reading database ... 119371 files and directories currently installed.)
Removing autopkgtest-satdep (0) ...

        
Release:disco
Architecture:arm64
Triggers:['pango1.0/1.42.4-4']
Running for:3h 50m 47s
[build JUT] sw_complex
S=/tmp/autopkgtest.NyhkAF/build.Yb1/src && I=$S/instdir && W=$S/workdir &&  rm -rf $W/JunitTest/sw_complex/user && mkdir -p $W/JunitTest/sw_complex/user/user && cp $S/qadevOOo/qa/registrymodifications.xcu $W/JunitTest/sw_complex/user/user/ && (/usr/lib/jvm/default-java/bin/java -Xmx64M -classpath "$W/JavaClassSet/JunitTest/sw_complex:/usr/share/java/junit4.jar:/lib::/usr/lib/libreoffice/program/classes/jurt.jar:/usr/lib/libreoffice/program/classes/test.jar:/usr/lib/libreoffice/program/classes/ScriptProviderForJava.jar:/usr/lib/libreoffice/program/classes/XMergeBridge.jar:/usr/lib/libreoffice/program/classes/xmerge.jar:/usr/lib/libreoffice/program/classes/ridl.jar:/usr/lib/libreoffice/program/classes/smoketest.jar:/usr/lib/libreoffice/program/classes/unoloader.jar:/usr/lib/libreoffice/program/classes/report.jar:/usr/lib/libreoffice/program/classes/unoil.jar:/usr/lib/libreoffice/program/classes/hsqldb.jar:/usr/lib/libreoffice/program/classes/table.jar:/usr/lib/libreoffice/program/classes/ScriptFramework.jar:/usr/lib/libreoffice/program/classes/java_uno.jar:/usr/lib/libreoffice/program/classes/ConnectivityTools.jar:/usr/lib/libreoffice/program/classes/query.jar:/usr/lib/libreoffice/program/classes/OOoRunner.jar:/usr/lib/libreoffice/program/classes/sdbc_hsqldb.jar:/usr/lib/libreoffice/program/classes/test-tools.jar:/usr/lib/libreoffice/program/classes/juh.jar:/usr/lib/libreoffice/program/classes/form.jar:/usr/lib/libreoffice/program/classes/commonwizards.jar" -Dorg.openoffice.test.arg.env=LD_LIBRARY_PATH"${LD_LIBRARY_PATH+=$LD_LIBRARY_PATH}" -Dorg.openoffice.test.arg.user=file://$W/JunitTest/sw_complex/user -Dorg.openoffice.test.arg.workdir=$W/JunitTest/sw_complex/user -Dorg.openoffice.test.arg.postprocesscommand=$S/solenv/bin/gdb-core-bt.sh -Dorg.openoffice.test.arg.soffice="path:/usr/lib/libreoffice/program/soffice" -Djava.library.path=/usr/lib/ure/lib  org.junit.runner.JUnitCore   2>&1)

        
Release:disco
Architecture:i386
Triggers:['pango1.0/1.42.4-4']
Running for:3h 10m 38s
Adding debian:QuoVadis_Root_CA_2.pem
Adding debian:ACCVRAIZ1.pem
Adding debian:Comodo_AAA_Services_root.pem
Adding debian:GeoTrust_Primary_Certification_Authority_-_G3.pem
Adding debian:Certinomis_-_Root_CA.pem
Adding debian:thawte_Primary_Root_CA_-_G3.pem
Adding debian:OpenTrust_Root_CA_G3.pem
Adding debian:SSL.com_Root_Certification_Authority_RSA.pem
Adding debian:Security_Communication_Root_CA.pem
Adding debian:Buypass_Class_2_Root_CA.pem
Adding debian:DigiCert_Assured_ID_Root_CA.pem
Adding debian:Autoridad_de_Certificacion_Firmaprofesional_CIF_A62634068.pem
Adding debian:Entrust_Root_Certification_Authority_-_EC1.pem
Adding debian:D-TRUST_Root_Class_3_CA_2_2009.pem
Adding debian:SSL.com_Root_Certification_Authority_ECC.pem
Adding debian:Staat_der_Nederlanden_Root_CA_-_G2.pem
Adding debian:ISRG_Root_X1.pem
Adding debian:GlobalSign_Root_CA_-_R3.pem
Adding debian:Global_Chambersign_Root_-_2008.pem
Adding debian:AffirmTrust_Networking.pem
done.
Setting up libreoffice-common (1:6.1.3-0ubuntu2) ...
Setting up ubuntu-mono (16.10+18.10.20181005-0ubuntu1) ...
Setting up default-jre (2:1.11-68ubuntu1) ...
Setting up libreoffice-core (1:6.1.3-0ubuntu2) ...
Setting up openjdk-11-jdk:i386 (11~28-3ubuntu2) ...
update-alternatives: using /usr/lib/jvm/java-11-openjdk-i386/bin/jconsole to provide /usr/bin/jconsole (jconsole) in auto mode
Setting up default-jdk (2:1.11-68ubuntu1) ...
Setting up libreoffice-java-common (1:6.1.3-0ubuntu2) ...
Setting up autopkgtest-satdep (0) ...
Processing triggers for libc-bin (2.28-0ubuntu1) ...
Processing triggers for systemd (239-7ubuntu10) ...
Processing triggers for libgdk-pixbuf2.0-0:i386 (2.38.0+dfsg-6) ...
Processing triggers for ca-certificates (20180409) ...
Updating certificates in /etc/ssl/certs...
0 added, 0 removed; done.
Running hooks in /etc/ca-certificates/update.d...

done.
done.
(Reading database ... 114107 files and directories currently installed.)
Removing autopkgtest-satdep (0) ...

        
Release:bionic
Architecture:armhf
Triggers:['openjdk-lts/10.0.2+13-1ubuntu0.18.04.4']
Ppas:['ubuntu-security-proposed/ppa']
Running for:1h 7m 4s
Setting up libreoffice-sdbc-hsqldb (1:6.0.6-0ubuntu0.18.04.1) ...
Setting up libreoffice-calc (1:6.0.6-0ubuntu0.18.04.1) ...
Setting up libknotifyconfig4 (4:4.14.38-0ubuntu3) ...
Setting up kdelibs-bin (4:4.14.38-0ubuntu3) ...
Setting up libkemoticons4 (4:4.14.38-0ubuntu3) ...
Setting up automoc (1.0~version-0.9.88-5build2) ...
Setting up libknewstuff3-4 (4:4.14.38-0ubuntu3) ...
Setting up libphonon-dev (4:4.10.0-2) ...
Setting up kdoctools (4:4.14.38-0ubuntu3) ...
Setting up libkparts4 (4:4.14.38-0ubuntu3) ...
Setting up libkmediaplayer4 (4:4.14.38-0ubuntu3) ...
Setting up libkde3support4 (4:4.14.38-0ubuntu3) ...
Setting up libedata-book1.2-dev:armhf (3.28.5-0ubuntu0.18.04.1) ...
Setting up libreoffice-writer (1:6.0.6-0ubuntu0.18.04.1) ...
Setting up libkrossui4 (4:4.14.38-0ubuntu3) ...
Setting up libreoffice-base (1:6.0.6-0ubuntu0.18.04.1) ...
Setting up libktexteditor4 (4:4.14.38-0ubuntu3) ...
Setting up libreoffice-report-builder-bin (1:6.0.6-0ubuntu0.18.04.1) ...
Setting up libkdewebkit5 (4:4.14.38-0ubuntu3) ...
Setting up libkprintutils4 (4:4.14.38-0ubuntu3) ...
Setting up libebook1.2-dev:armhf (3.28.5-0ubuntu0.18.04.1) ...
Setting up libkutils4 (4:4.14.38-0ubuntu3) ...
Setting up libkhtml5 (4:4.14.38-0ubuntu3) ...
Setting up libreoffice (1:6.0.6-0ubuntu0.18.04.1) ...
Setting up libplasma3 (4:4.14.38-0ubuntu3) ...
Setting up kdelibs5-dev (4:4.14.38-0ubuntu3) ...
Setting up autopkgtest-satdep (0) ...
Processing triggers for libc-bin (2.27-3ubuntu1) ...
Processing triggers for systemd (237-3ubuntu10.9) ...
Processing triggers for dictionaries-common (1.27.2) ...
Processing triggers for libgdk-pixbuf2.0-0:armhf (2.36.11-2) ...
Processing triggers for ca-certificates (20180409) ...
Updating certificates in /etc/ssl/certs...
0 added, 0 removed; done.
Running hooks in /etc/ca-certificates/update.d...

done.
done.
(Reading database ... 109827 files and directories currently installed.)
Removing autopkgtest-satdep (0) ...

        
Release:bionic
Architecture:s390x
Triggers:['openjdk-lts/10.0.2+13-1ubuntu0.18.04.4']
Ppas:['ubuntu-security-proposed/ppa']
Running for:0h 36m 14s
Preparing to unpack .../04-libirs160_1%3a9.11.3+dfsg-1ubuntu1.3_s390x.deb ...
Unpacking libirs160:s390x (1:9.11.3+dfsg-1ubuntu1.3) over (1:9.11.3+dfsg-1ubuntu1.2) ...
Preparing to unpack .../05-bind9-host_1%3a9.11.3+dfsg-1ubuntu1.3_s390x.deb ...
Unpacking bind9-host (1:9.11.3+dfsg-1ubuntu1.3) over (1:9.11.3+dfsg-1ubuntu1.2) ...
Preparing to unpack .../06-dnsutils_1%3a9.11.3+dfsg-1ubuntu1.3_s390x.deb ...
Unpacking dnsutils (1:9.11.3+dfsg-1ubuntu1.3) over (1:9.11.3+dfsg-1ubuntu1.2) ...
Preparing to unpack .../07-libbind9-160_1%3a9.11.3+dfsg-1ubuntu1.3_s390x.deb ...
Unpacking libbind9-160:s390x (1:9.11.3+dfsg-1ubuntu1.3) over (1:9.11.3+dfsg-1ubuntu1.2) ...
Preparing to unpack .../08-libisccfg160_1%3a9.11.3+dfsg-1ubuntu1.3_s390x.deb ...
Unpacking libisccfg160:s390x (1:9.11.3+dfsg-1ubuntu1.3) over (1:9.11.3+dfsg-1ubuntu1.2) ...
Preparing to unpack .../09-libisccc160_1%3a9.11.3+dfsg-1ubuntu1.3_s390x.deb ...
Unpacking libisccc160:s390x (1:9.11.3+dfsg-1ubuntu1.3) over (1:9.11.3+dfsg-1ubuntu1.2) ...
Preparing to unpack .../10-libdns1100_1%3a9.11.3+dfsg-1ubuntu1.3_s390x.deb ...
Unpacking libdns1100:s390x (1:9.11.3+dfsg-1ubuntu1.3) over (1:9.11.3+dfsg-1ubuntu1.2) ...
Preparing to unpack .../11-libisc169_1%3a9.11.3+dfsg-1ubuntu1.3_s390x.deb ...
Unpacking libisc169:s390x (1:9.11.3+dfsg-1ubuntu1.3) over (1:9.11.3+dfsg-1ubuntu1.2) ...
Preparing to unpack .../12-liblwres160_1%3a9.11.3+dfsg-1ubuntu1.3_s390x.deb ...
Unpacking liblwres160:s390x (1:9.11.3+dfsg-1ubuntu1.3) over (1:9.11.3+dfsg-1ubuntu1.2) ...
Preparing to unpack .../13-python3-gdbm_3.6.7-1~18.04_s390x.deb ...
Unpacking python3-gdbm:s390x (3.6.7-1~18.04) over (3.6.5-3) ...
Preparing to unpack .../14-python3-update-manager_1%3a18.04.11.7_all.deb ...
Unpacking python3-update-manager (1:18.04.11.7) over (1:18.04.11.6) ...
Preparing to unpack .../15-linux-firmware_1.173.2_all.deb ...
Unpacking linux-firmware (1.173.2) over (1.173.1) ...

        
Release:bionic
Architecture:i386
Triggers:['openjdk-lts/10.0.2+13-1ubuntu0.18.04.4']
Ppas:['ubuntu-security-proposed/ppa']
Running for:0h 45m 45s
Setting up libisccfg160:i386 (1:9.11.3+dfsg-1ubuntu1.3) ...
Setting up python3-gdbm:i386 (3.6.7-1~18.04) ...
Setting up libirs160:i386 (1:9.11.3+dfsg-1ubuntu1.3) ...
Setting up libbind9-160:i386 (1:9.11.3+dfsg-1ubuntu1.3) ...
Setting up bind9-host (1:9.11.3+dfsg-1ubuntu1.3) ...
Setting up dnsutils (1:9.11.3+dfsg-1ubuntu1.3) ...
Processing triggers for initramfs-tools (0.130ubuntu3.5) ...
update-initramfs: Generating /boot/initrd.img-4.15.0-39-generic
Processing triggers for libc-bin (2.27-3ubuntu1) ...
autopkgtest [19:28:43]: rebooting testbed after setup commands that affected boot
Exit request sent.
autopkgtest-virt-ssh: WARNING: ssh connection failed. Retrying in 3 seconds...
autopkgtest-virt-ssh: WARNING: ssh connection failed. Retrying in 3 seconds...
autopkgtest [19:29:27]: testbed running kernel: Linux 4.15.0-39-generic #42-Ubuntu SMP Tue Oct 23 15:43:58 UTC 2018
autopkgtest [19:29:27]: testbed dpkg architecture: i386
autopkgtest [19:29:29]: @@@@@@@@@@@@@@@@@@@@ apt-source libreoffice
Get:1 http://ftpmaster.internal/ubuntu bionic-updates/main libreoffice 1:6.0.6-0ubuntu0.18.04.1 (dsc) [17.7 kB]
Get:2 http://ftpmaster.internal/ubuntu bionic-updates/main libreoffice 1:6.0.6-0ubuntu0.18.04.1 (tar) [2423 kB]
Get:3 http://ftpmaster.internal/ubuntu bionic-updates/main libreoffice 1:6.0.6-0ubuntu0.18.04.1 (tar) [202 MB]
Get:4 http://ftpmaster.internal/ubuntu bionic-updates/main libreoffice 1:6.0.6-0ubuntu0.18.04.1 (tar) [140 MB]
Get:5 http://ftpmaster.internal/ubuntu bionic-updates/main libreoffice 1:6.0.6-0ubuntu0.18.04.1 (tar) [183 MB]
Get:6 http://ftpmaster.internal/ubuntu bionic-updates/main libreoffice 1:6.0.6-0ubuntu0.18.04.1 (diff) [2171 kB]
gpgv: Signature made Thu Aug 30 09:58:12 2018 UTC
gpgv:                using RSA key 384AFD31CEFE0600F9E8DA7DD328D72318ACE6C7
gpgv: Can't check signature: No public key
dpkg-source: warning: failed to verify signature on ./libreoffice_6.0.6-0ubuntu0.18.04.1.dsc

        
Release:bionic
Architecture:amd64
Triggers:['openjdk-lts/10.0.2+13-1ubuntu0.18.04.4']
Ppas:['ubuntu-security-proposed/ppa']
Running for:0h 49m 37s
Setting up libreoffice-sdbc-hsqldb (1:6.0.6-0ubuntu0.18.04.1) ...
Setting up libreoffice-calc (1:6.0.6-0ubuntu0.18.04.1) ...
Setting up libknotifyconfig4 (4:4.14.38-0ubuntu3) ...
Setting up kdelibs-bin (4:4.14.38-0ubuntu3) ...
Setting up libkemoticons4 (4:4.14.38-0ubuntu3) ...
Setting up automoc (1.0~version-0.9.88-5build2) ...
Setting up libknewstuff3-4 (4:4.14.38-0ubuntu3) ...
Setting up libphonon-dev (4:4.10.0-2) ...
Setting up kdoctools (4:4.14.38-0ubuntu3) ...
Setting up libkparts4 (4:4.14.38-0ubuntu3) ...
Setting up libkmediaplayer4 (4:4.14.38-0ubuntu3) ...
Setting up libkde3support4 (4:4.14.38-0ubuntu3) ...
Setting up libedata-book1.2-dev:amd64 (3.28.5-0ubuntu0.18.04.1) ...
Setting up libreoffice-writer (1:6.0.6-0ubuntu0.18.04.1) ...
Setting up libkrossui4 (4:4.14.38-0ubuntu3) ...
Setting up libreoffice-base (1:6.0.6-0ubuntu0.18.04.1) ...
Setting up libktexteditor4 (4:4.14.38-0ubuntu3) ...
Setting up libreoffice-report-builder-bin (1:6.0.6-0ubuntu0.18.04.1) ...
Setting up libkdewebkit5 (4:4.14.38-0ubuntu3) ...
Setting up libkprintutils4 (4:4.14.38-0ubuntu3) ...
Setting up libebook1.2-dev:amd64 (3.28.5-0ubuntu0.18.04.1) ...
Setting up libkutils4 (4:4.14.38-0ubuntu3) ...
Setting up libkhtml5 (4:4.14.38-0ubuntu3) ...
Setting up libreoffice (1:6.0.6-0ubuntu0.18.04.1) ...
Setting up libplasma3 (4:4.14.38-0ubuntu3) ...
Setting up kdelibs5-dev (4:4.14.38-0ubuntu3) ...
Setting up autopkgtest-satdep (0) ...
Processing triggers for libc-bin (2.27-3ubuntu1) ...
Processing triggers for systemd (237-3ubuntu10.9) ...
Processing triggers for dictionaries-common (1.27.2) ...
Processing triggers for libgdk-pixbuf2.0-0:amd64 (2.36.11-2) ...
Processing triggers for ca-certificates (20180409) ...
Updating certificates in /etc/ssl/certs...
0 added, 0 removed; done.
Running hooks in /etc/ca-certificates/update.d...

done.
done.
(Reading database ... 125817 files and directories currently installed.)
Removing autopkgtest-satdep (0) ...

        
Release:bionic
Architecture:ppc64el
Triggers:['openjdk-lts/10.0.2+13-1ubuntu0.18.04.4']
Ppas:['ubuntu-security-proposed/ppa']
Running for:1h 8m 19s

        

linux

Release:bionic
Architecture:i386
Triggers:['systemd/237-3ubuntu10.10']
Running for:5h 34m 1s
  CC [M]  drivers/staging/rtl8723bs/os_dep/wifi_regd.o
  CC [M]  drivers/staging/wlan-ng/prism2usb.o
  CC [M]  drivers/staging/rtl8723bs/os_dep/xmit_linux.o
  CC [M]  drivers/staging/rtlwifi/phydm/phydm_adaptivity.o
  CC [M]  drivers/staging/rtlwifi/phydm/phydm_cfotracking.o
  LD [M]  drivers/staging/rtl8723bs/r8723bs.o
  CC [M]  drivers/staging/rtlwifi/phydm/phydm_noisemonitor.o
  CC [M]  drivers/staging/rtlwifi/phydm/phydm_acs.o
  CC [M]  drivers/staging/wlan-ng/p80211conv.o
  CC [M]  drivers/staging/rtlwifi/phydm/phydm_psd.o
  CC [M]  drivers/staging/rtlwifi/phydm/phydm_adc_sampling.o
  CC [M]  drivers/staging/wlan-ng/p80211req.o
  CC [M]  drivers/staging/xgifb/XGI_main_26.o
  CC [M]  drivers/staging/xgifb/vb_init.o
  CC [M]  drivers/staging/wlan-ng/p80211wep.o
  CC [M]  drivers/staging/rtlwifi/phydm/phydm_kfree.o
  CC [M]  drivers/staging/xgifb/vb_setmode.o
  CC [M]  drivers/staging/wlan-ng/p80211netdev.o
  CC [M]  drivers/staging/rtlwifi/phydm/phydm_ccx.o
  CC [M]  drivers/staging/rtlwifi/phydm/rtl8822b/halhwimg8822b_bb.o
  CC [M]  drivers/staging/rtlwifi/phydm/rtl8822b/halhwimg8822b_mac.o
  LD [M]  drivers/staging/wlan-ng/prism2_usb.o
  CC [M]  drivers/staging/rtlwifi/phydm/rtl8822b/halhwimg8822b_rf.o
  CC [M]  drivers/staging/rtlwifi/phydm/rtl8822b/halphyrf_8822b.o
  LD [M]  drivers/staging/xgifb/xgifb.o
  CC [M]  drivers/staging/rtlwifi/phydm/rtl8822b/phydm_hal_api8822b.o
  CC [M]  drivers/staging/rtlwifi/phydm/rtl8822b/phydm_iqk_8822b.o
  CC [M]  drivers/staging/rtlwifi/phydm/rtl8822b/phydm_regconfig8822b.o
  CC [M]  drivers/staging/rtlwifi/phydm/rtl8822b/phydm_rtl8822b.o
  CC [M]  drivers/staging/rtlwifi/phydm/rtl_phydm.o
  LD [M]  drivers/staging/rtlwifi/r8822be.o
  AR      drivers/staging/built-in.o
  AR      drivers/built-in.o
  GEN     .version
  CHK     include/generated/compile.h
  AR      built-in.o
  LD      vmlinux.o
  MODPOST vmlinux.o
  KSYM    .tmp_kallsyms1.o
  KSYM    .tmp_kallsyms2.o
  LD      vmlinux

        
Release:bionic
Architecture:amd64
Triggers:['systemd/237-3ubuntu10.10']
Running for:6h 9m 49s
Unpacking gcc-multilib (4:7.3.0-3ubuntu2.1) ...
Selecting previously unselected package libdw1:amd64.
Preparing to unpack .../53-libdw1_0.170-0.4_amd64.deb ...
Unpacking libdw1:amd64 (0.170-0.4) ...
Selecting previously unselected package libbabeltrace1:amd64.
Preparing to unpack .../54-libbabeltrace1_1.5.5-1_amd64.deb ...
Unpacking libbabeltrace1:amd64 (1.5.5-1) ...
Selecting previously unselected package gdb.
Preparing to unpack .../55-gdb_8.1-0ubuntu3_amd64.deb ...
Unpacking gdb (8.1-0ubuntu3) ...
Selecting previously unselected package git.
Preparing to unpack .../56-git_1%3a2.17.1-1ubuntu0.3_amd64.deb ...
Unpacking git (1:2.17.1-1ubuntu0.3) ...
Selecting previously unselected package libpython2.7-minimal:amd64.
Preparing to unpack .../57-libpython2.7-minimal_2.7.15~rc1-1ubuntu0.1_amd64.deb ...
Unpacking libpython2.7-minimal:amd64 (2.7.15~rc1-1ubuntu0.1) ...
Selecting previously unselected package python2.7-minimal.
Preparing to unpack .../58-python2.7-minimal_2.7.15~rc1-1ubuntu0.1_amd64.deb ...
Unpacking python2.7-minimal (2.7.15~rc1-1ubuntu0.1) ...
Selecting previously unselected package python-minimal.
Preparing to unpack .../59-python-minimal_2.7.15~rc1-1_amd64.deb ...
Unpacking python-minimal (2.7.15~rc1-1) ...
Selecting previously unselected package libpython2.7-stdlib:amd64.
Preparing to unpack .../60-libpython2.7-stdlib_2.7.15~rc1-1ubuntu0.1_amd64.deb ...
Unpacking libpython2.7-stdlib:amd64 (2.7.15~rc1-1ubuntu0.1) ...
Selecting previously unselected package python2.7.
Preparing to unpack .../61-python2.7_2.7.15~rc1-1ubuntu0.1_amd64.deb ...
Unpacking python2.7 (2.7.15~rc1-1ubuntu0.1) ...
Selecting previously unselected package libpython-stdlib:amd64.
Preparing to unpack .../62-libpython-stdlib_2.7.15~rc1-1_amd64.deb ...
Unpacking libpython-stdlib:amd64 (2.7.15~rc1-1) ...
Setting up libpython2.7-minimal:amd64 (2.7.15~rc1-1ubuntu0.1) ...
Setting up python2.7-minimal (2.7.15~rc1-1ubuntu0.1) ...

        
Release:bionic
Architecture:arm64
Triggers:['systemd/237-3ubuntu10.10']
Running for:5h 45m 18s
19:36:34 DEBUG| [stdout] sysinfo RETURNED 0
19:36:34 DEBUG| [stdout] sysinfo PASSED
19:36:34 DEBUG| [stdout] sysfs STARTING
19:36:39 DEBUG| [stdout] sysfs RETURNED 0
19:36:39 DEBUG| [stdout] sysfs PASSED
19:36:39 DEBUG| [stdout] tee STARTING
19:36:44 DEBUG| [stdout] tee RETURNED 0
19:36:44 DEBUG| [stdout] tee PASSED
19:36:44 DEBUG| [stdout] timer STARTING
19:36:50 DEBUG| [stdout] timer RETURNED 0
19:36:51 DEBUG| [stdout] timer PASSED
19:36:51 DEBUG| [stdout] timerfd STARTING
19:36:56 DEBUG| [stdout] timerfd RETURNED 0
19:36:56 DEBUG| [stdout] timerfd PASSED
19:36:56 DEBUG| [stdout] tlb-shootdown STARTING
19:37:01 DEBUG| [stdout] tlb-shootdown RETURNED 0
19:37:01 DEBUG| [stdout] tlb-shootdown PASSED
19:37:01 DEBUG| [stdout] tmpfs STARTING
19:37:06 DEBUG| [stdout] tmpfs RETURNED 0
19:37:06 DEBUG| [stdout] tmpfs PASSED
19:37:06 DEBUG| [stdout] tree STARTING
19:37:11 DEBUG| [stdout] tree RETURNED 0
19:37:11 DEBUG| [stdout] tree PASSED
19:37:11 DEBUG| [stdout] tsearch STARTING
19:37:16 DEBUG| [stdout] tsearch RETURNED 0
19:37:16 DEBUG| [stdout] tsearch PASSED
19:37:16 DEBUG| [stdout] udp STARTING
19:37:21 DEBUG| [stdout] udp RETURNED 0
19:37:21 DEBUG| [stdout] udp PASSED
19:37:21 DEBUG| [stdout] udp-flood STARTING
19:37:26 DEBUG| [stdout] udp-flood RETURNED 0
19:37:26 DEBUG| [stdout] udp-flood PASSED
19:37:26 DEBUG| [stdout] unshare STARTING
19:37:31 DEBUG| [stdout] unshare RETURNED 0
19:37:31 DEBUG| [stdout] unshare PASSED
19:37:31 DEBUG| [stdout] urandom STARTING
19:37:36 DEBUG| [stdout] urandom RETURNED 0
19:37:36 DEBUG| [stdout] urandom PASSED
19:37:36 DEBUG| [stdout] userfaultfd STARTING
19:37:41 DEBUG| [stdout] userfaultfd RETURNED 0
19:37:41 DEBUG| [stdout] userfaultfd PASSED
19:37:41 DEBUG| [stdout] utime STARTING
19:37:46 DEBUG| [stdout] utime RETURNED 0
19:37:46 DEBUG| [stdout] utime PASSED
19:37:46 DEBUG| [stdout] vdso STARTING
19:37:51 DEBUG| [stdout] vdso RETURNED 0
19:37:51 DEBUG| [stdout] vdso PASSED
19:37:51 DEBUG| [stdout] vfork STARTING

        

mshr

Release:disco
Architecture:arm64
Triggers:['dolfin/2018.1.0.post1-12build1']
Requester:ginggs
Running for:0h 7m 1s
Setting up libboost-thread1.67.0:arm64 (1.67.0-10) ...
Setting up librbio2:arm64 (1:5.3.0+dfsg-1) ...
Setting up python3-pytest (3.6.4-1) ...
Setting up libcamd2:arm64 (1:5.3.0+dfsg-1) ...
Setting up libaec-dev:arm64 (1.0.2-1) ...
Setting up python2.7 (2.7.15-4ubuntu4) ...
Setting up libproj13:arm64 (5.2.0-1) ...
Setting up libharfbuzz0b:arm64 (2.1.1-1build1) ...
Setting up libsuperlu5:arm64 (5.2.1+dfsg1-3build1) ...
Setting up libhwloc5:arm64 (1.11.11-2) ...
Setting up libglib2.0-dev:arm64 (2.58.1-2) ...
Setting up libhwloc-plugins:arm64 (1.11.11-2) ...
Setting up libamd2:arm64 (1:5.3.0+dfsg-1) ...
Setting up libjpeg8-dev:arm64 (8c-2ubuntu8) ...
Setting up libsuperlu-dev:arm64 (5.2.1+dfsg1-3build1) ...
Setting up gir1.2-harfbuzz-0.0:arm64 (2.1.1-1build1) ...
Setting up libjpeg-dev:arm64 (8c-2ubuntu8) ...
Setting up ibverbs-providers:arm64 (20.0-1) ...
Setting up libboost-chrono1.67.0:arm64 (1.67.0-10) ...
Setting up libfftw3-dev:arm64 (3.3.8-2) ...
Setting up libarpack2:arm64 (3.6.3-1) ...
Setting up libpython2-stdlib:arm64 (2.7.15-3) ...
Setting up libgfortran-8-dev:arm64 (8.2.0-9ubuntu1) ...
Setting up cmake (3.12.3-3) ...
Setting up libibverbs-dev:arm64 (20.0-1) ...
Setting up libharfbuzz-gobject0:arm64 (2.1.1-1build1) ...
Setting up liblapack-dev:arm64 (3.8.0-1build1) ...
update-alternatives: using /usr/lib/aarch64-linux-gnu/lapack/liblapack.so to provide /usr/lib/aarch64-linux-gnu/liblapack.so (liblapack.so-aarch64-linux-gnu) in auto mode
Setting up libproj-dev:arm64 (5.2.0-1) ...
Setting up libboost-timer1.67.0:arm64 (1.67.0-10) ...
Setting up libgcc-6-dev:arm64 (6.5.0-2ubuntu1) ...
Setting up libstdc++-6-dev:arm64 (6.5.0-2ubuntu1) ...
Setting up libharfbuzz-icu0:arm64 (2.1.1-1build1) ...
Setting up libhwloc-dev:arm64 (1.11.11-2) ...
Setting up python3-numpy (1:1.14.5-1ubuntu7) ...

        

nemo

Release:cosmic
Architecture:i386
Triggers:['gvfs/1.38.1-0ubuntu1']
Running for:0h 19m 21s
Selecting previously unselected package libiculx60:i386.
Preparing to unpack .../194-libiculx60_60.2-6ubuntu1_i386.deb ...
Unpacking libiculx60:i386 (60.2-6ubuntu1) ...
Selecting previously unselected package icu-devtools.
Preparing to unpack .../195-icu-devtools_60.2-6ubuntu1_i386.deb ...
Unpacking icu-devtools (60.2-6ubuntu1) ...
Selecting previously unselected package libicu-le-hb-dev:i386.
Preparing to unpack .../196-libicu-le-hb-dev_1.0.3+git161113-5_i386.deb ...
Unpacking libicu-le-hb-dev:i386 (1.0.3+git161113-5) ...
Selecting previously unselected package libicu-dev.
Preparing to unpack .../197-libicu-dev_60.2-6ubuntu1_i386.deb ...
Unpacking libicu-dev (60.2-6ubuntu1) ...
Selecting previously unselected package libharfbuzz-dev:i386.
Preparing to unpack .../198-libharfbuzz-dev_1.8.8-2_i386.deb ...
Unpacking libharfbuzz-dev:i386 (1.8.8-2) ...
Selecting previously unselected package libxft-dev:i386.
Preparing to unpack .../199-libxft-dev_2.3.2-2_i386.deb ...
Unpacking libxft-dev:i386 (2.3.2-2) ...
Selecting previously unselected package libpango1.0-dev.
Preparing to unpack .../200-libpango1.0-dev_1.42.4-3_i386.deb ...
Unpacking libpango1.0-dev (1.42.4-3) ...
Selecting previously unselected package x11proto-composite-dev.
Preparing to unpack .../201-x11proto-composite-dev_1%3a2018.4-4_all.deb ...
Unpacking x11proto-composite-dev (1:2018.4-4) ...
Selecting previously unselected package libxcomposite-dev:i386.
Preparing to unpack .../202-libxcomposite-dev_1%3a0.4.4-2_i386.deb ...
Unpacking libxcomposite-dev:i386 (1:0.4.4-2) ...
Selecting previously unselected package libxcursor-dev:i386.
Preparing to unpack .../203-libxcursor-dev_1%3a1.1.15-1_i386.deb ...
Unpacking libxcursor-dev:i386 (1:1.1.15-1) ...
Selecting previously unselected package x11proto-xinerama-dev.
Preparing to unpack .../204-x11proto-xinerama-dev_2018.4-4_all.deb ...
Unpacking x11proto-xinerama-dev (2018.4-4) ...

        
Release:bionic
Architecture:amd64
Triggers:['gvfs/1.36.1-0ubuntu1.2']
Running for:0h 43m 0s
dh_installmime -pnemo-data
make[1]: Leaving directory '/tmp/autopkgtest.f22xGp/build.4hV/src'
   dh_installgsettings
   dh_lintian
   dh_icons
   dh_perl
   dh_link
   dh_strip_nondeterminism
   dh_compress
   dh_fixperms
   dh_missing
   debian/rules override_dh_strip
make[1]: Entering directory '/tmp/autopkgtest.f22xGp/build.4hV/src'
dh_strip --dbgsym-migration='nemo-dbg (<< 3.0.1-1~)' || dh_strip
make[1]: Leaving directory '/tmp/autopkgtest.f22xGp/build.4hV/src'
   debian/rules override_dh_makeshlibs
make[1]: Entering directory '/tmp/autopkgtest.f22xGp/build.4hV/src'
dh_makeshlibs -Xusr/lib/nemo/extensions-3.0/
make[1]: Leaving directory '/tmp/autopkgtest.f22xGp/build.4hV/src'
   dh_shlibdeps
   dh_girepository
   dh_installdeb
   dh_gencontrol
   dh_md5sums
   dh_builddeb
dpkg-deb: building package 'gir1.2-nemo-3.0' in '../gir1.2-nemo-3.0_3.6.5-1_amd64.deb'.
dpkg-deb: building package 'libnemo-extension-dev' in '../libnemo-extension-dev_3.6.5-1_amd64.deb'.
dpkg-deb: building package 'libnemo-extension1' in '../libnemo-extension1_3.6.5-1_amd64.deb'.
dpkg-deb: building package 'libnemo-extension1-dbgsym' in 'debian/.debhelper/scratch-space/build-libnemo-extension1/libnemo-extension1-dbgsym_3.6.5-1_amd64.deb'.
	Renaming libnemo-extension1-dbgsym_3.6.5-1_amd64.deb to libnemo-extension1-dbgsym_3.6.5-1_amd64.ddeb
dpkg-deb: building package 'nemo' in '../nemo_3.6.5-1_amd64.deb'.
dpkg-deb: building package 'nemo-dbgsym' in 'debian/.debhelper/scratch-space/build-nemo/nemo-dbgsym_3.6.5-1_amd64.deb'.
	Renaming nemo-dbgsym_3.6.5-1_amd64.deb to nemo-dbgsym_3.6.5-1_amd64.ddeb
dpkg-deb: building package 'nemo-data' in '../nemo-data_3.6.5-1_all.deb'.
 dpkg-genbuildinfo --build=binary
 dpkg-genchanges --build=binary >../nemo_3.6.5-1_amd64.changes
dpkg-genchanges: info: binary-only upload (no source code included)
 dpkg-source --after-build src
dpkg-buildpackage: info: binary-only upload (no source included)
autopkgtest [19:36:24]: test testsuite: preparing testbed

        
Release:bionic
Architecture:arm64
Triggers:['gvfs/1.36.1-0ubuntu1.2']
Running for:0h 34m 46s
Get:85 http://ftpmaster.internal/ubuntu bionic/main arm64 humanity-icon-theme all 0.6.15 [1250 kB]
Get:86 http://ftpmaster.internal/ubuntu bionic-updates/main arm64 ubuntu-mono all 16.10+18.04.20181005-0ubuntu1 [149 kB]
Get:87 http://ftpmaster.internal/ubuntu bionic/main arm64 adwaita-icon-theme all 3.28.0-1ubuntu1 [3306 kB]
Get:88 http://ftpmaster.internal/ubuntu bionic/main arm64 libgtk-3-0 arm64 3.22.30-1ubuntu1 [2064 kB]
Get:89 http://ftpmaster.internal/ubuntu bionic/main arm64 gir1.2-gtk-3.0 arm64 3.22.30-1ubuntu1 [194 kB]
Get:90 http://ftpmaster.internal/ubuntu bionic-updates/main arm64 x11-common all 1:7.7+19ubuntu7.1 [22.5 kB]
Get:91 http://ftpmaster.internal/ubuntu bionic/main arm64 libxtst6 arm64 2:1.2.3-1 [11.7 kB]
Get:92 http://ftpmaster.internal/ubuntu bionic/main arm64 at-spi2-core arm64 2.28.0-1 [43.3 kB]
Get:93 http://ftpmaster.internal/ubuntu bionic/main arm64 libgail-3-0 arm64 3.22.30-1ubuntu1 [19.8 kB]
Get:94 http://ftpmaster.internal/ubuntu bionic/universe arm64 libnemo-extension1 arm64 3.6.5-1 [60.4 kB]
Get:95 http://ftpmaster.internal/ubuntu bionic/universe arm64 gir1.2-nemo-3.0 arm64 3.6.5-1 [7740 B]
Get:96 http://ftpmaster.internal/ubuntu bionic-updates/main arm64 libglib2.0-bin arm64 2.56.3-0ubuntu0.18.04.1 [61.8 kB]
Get:97 http://ftpmaster.internal/ubuntu bionic-updates/main arm64 python3-lib2to3 all 3.6.7-1~18.04 [76.5 kB]
Get:98 http://ftpmaster.internal/ubuntu bionic-updates/main arm64 python3-distutils all 3.6.7-1~18.04 [141 kB]
Get:99 http://ftpmaster.internal/ubuntu bionic-updates/main arm64 libglib2.0-dev-bin arm64 2.56.3-0ubuntu0.18.04.1 [99.7 kB]
Get:100 http://ftpmaster.internal/ubuntu bionic/main arm64 libc-dev-bin arm64 2.27-3ubuntu1 [58.6 kB]
Get:101 http://ftpmaster.internal/ubuntu bionic-updates/main arm64 linux-libc-dev arm64 4.15.0-39.42 [986 kB]
Get:102 http://ftpmaster.internal/ubuntu bionic/main arm64 libc6-dev arm64 2.27-3ubuntu1 [2052 kB]

        

nova

Release:cosmic
Architecture:i386
Triggers:['open-iscsi/2.0.874-5ubuntu9.1']
Running for:1h 25m 0s
Preparing to unpack .../nova-compute-kvm_2%3a18.0.1-0ubuntu1_all.deb ...
Unpacking nova-compute-kvm (2:18.0.1-0ubuntu1) ...
Selecting previously unselected package nova-compute.
Preparing to unpack .../nova-compute_2%3a18.0.1-0ubuntu1_all.deb ...
Unpacking nova-compute (2:18.0.1-0ubuntu1) ...
Setting up nova-compute-kvm (2:18.0.1-0ubuntu1) ...
Installing new version of config file /etc/nova/nova-compute.conf ...
Processing triggers for systemd (239-7ubuntu10.4) ...
Processing triggers for man-db (2.8.4-2) ...
Setting up nova-compute (2:18.0.1-0ubuntu1) ...
Setting up autopkgtest-satdep (0) ...
(Reading database ... 81288 files and directories currently installed.)
Removing autopkgtest-satdep (0) ...
autopkgtest [19:34:19]: test nova-daemons: [-----------------------
WARNING: cell0 mapping not found - not syncing cell0.
OK
OK
OK
OK
OK
autopkgtest [19:36:35]: test nova-daemons: -----------------------]
autopkgtest [19:36:36]: test nova-daemons:  - - - - - - - - - - results - - - - - - - - - -
nova-daemons         PASS
autopkgtest [19:36:37]: test nova-api: preparing testbed
Reading package lists...
Building dependency tree...
Reading state information...
Starting pkgProblemResolver with broken count: 0
Starting 2 pkgProblemResolver with broken count: 0
Done
0 upgraded, 0 newly installed, 0 to remove and 0 not upgraded.
1 not fully installed or removed.
After this operation, 0 B of additional disk space will be used.
Setting up autopkgtest-satdep (0) ...
(Reading database ... 81288 files and directories currently installed.)
Removing autopkgtest-satdep (0) ...
autopkgtest [19:37:07]: test nova-api: [-----------------------
OK

        
Release:cosmic
Architecture:arm64
Triggers:['open-iscsi/2.0.874-5ubuntu9.1']
Running for:0h 20m 31s
update-alternatives: using /usr/bin/python3-migrate-repository to provide /usr/bin/migrate-repository (migrate-repository) in auto mode
Setting up libpython2-stdlib:arm64 (2.7.15-3) ...
Setting up python3-pastedeploy (1.5.2-4) ...
Setting up libxen-4.9:arm64 (4.9.2-0ubuntu2) ...
Setting up python3-deprecation (2.0.5-1) ...
Setting up python3-cffi (1.11.5-3ubuntu1) ...
Setting up libavahi-common3:arm64 (0.7-4ubuntu2) ...
Setting up xmlsec1 (1.2.26-3) ...
Setting up erlang-odbc (1:20.3.8.5+dfsg-1build1) ...
Setting up python3-oslo.i18n (3.21.0-0ubuntu1) ...
Setting up alembic (1.0.0-1ubuntu1) ...
Setting up libapache2-mod-wsgi-py3 (4.5.17-1build1) ...
Package apache2 is not configured yet. Will defer actions by package libapache2-mod-wsgi-py3.
Setting up python3-oslo.context (1:2.21.0-0ubuntu1) ...
Setting up apache2 (2.4.34-1ubuntu2) ...
Enabling module mpm_event.
Enabling module authz_core.
Enabling module authz_host.
Enabling module authn_core.
Enabling module auth_basic.
Enabling module access_compat.
Enabling module authn_file.
Enabling module authz_user.
Enabling module alias.
Enabling module dir.
Enabling module autoindex.
Enabling module env.
Enabling module mime.
Enabling module negotiation.
Enabling module setenvif.
Enabling module filter.
Enabling module deflate.
Enabling module status.
Enabling module reqtimeout.
Enabling conf charset.
Enabling conf localized-error-pages.
Enabling conf other-vhosts-access-log.
Enabling conf security.
Enabling conf serve-cgi-bin.
Enabling site 000-default.
info: Executing deferred 'a2enmod wsgi' for package libapache2-mod-wsgi-py3
Enabling module wsgi.
Created symlink /etc/systemd/system/multi-user.target.wants/apache2.service → /lib/systemd/system/apache2.service.
Created symlink /etc/systemd/system/multi-user.target.wants/apache-htcacheclean.service → /lib/systemd/system/apache-htcacheclean.service.
Setting up python3-numpy (1:1.14.5-1ubuntu4) ...

        
Release:cosmic
Architecture:armhf
Triggers:['openssh/1:7.7p1-4ubuntu0.1']
Running for:0h 36m 42s
Setting up erlang-erl-docgen (1:20.3.8.5+dfsg-1build1) ...
Setting up python-colorama (0.3.7-1) ...
Setting up python-vine (1.1.4+dfsg-2) ...
Setting up librbd1 (12.2.4-0ubuntu1.1build1) ...
Setting up python-microversion-parse (0.2.1-0ubuntu1) ...
Setting up python-pkg-resources (40.2.0-1) ...
Setting up python-roman (2.0.0-3) ...
Setting up qemu-block-extra:armhf (1:2.12+dfsg-3ubuntu8) ...
Setting up python-pyasn1-modules (0.2.1-0.2) ...
Setting up python-jwt (1.6.4-1) ...
Setting up python-aniso8601 (3.0.2-1) ...
Setting up python-markupsafe (1.0-1build2) ...
Setting up python-numpy (1:1.14.5-1ubuntu4) ...
Setting up qemu-utils (1:2.12+dfsg-3ubuntu8) ...
Setting up python-netifaces (0.10.4-1build1) ...
Setting up python-werkzeug (0.14.1+dfsg1-1) ...
Setting up python-pyinotify (0.9.6-1) ...
Setting up python-amqp (2.3.2-1) ...
Setting up libxmu6:armhf (2:1.1.2-2) ...
Setting up erlang-nox (1:20.3.8.5+dfsg-1build1) ...
Setting up python-httplib2 (0.11.3-1) ...
Setting up python-scrypt (0.8.0-0ubuntu4) ...
Setting up python-configparser (3.5.0b2-1) ...
Setting up python-cffi-backend (1.11.5-3ubuntu1) ...
Setting up libvirt-daemon (4.6.0-2ubuntu3) ...
Setting up python-six (1.11.0-2) ...
Setting up python-pygments (2.2.0+dfsg-2) ...
Setting up python-posix-ipc (0.9.8-3build1) ...
Setting up python-zope.interface (4.3.2-1build3) ...
Setting up python-mako (1.0.7+ds1-1) ...
Setting up python-psutil (5.4.6-1build1) ...
Setting up python-packaging (17.1-1) ...
Setting up python-pbr (4.2.0-0ubuntu3) ...
update-alternatives: using /usr/bin/python2-pbr to provide /usr/bin/pbr (pbr) in auto mode
Setting up python-jsonpatch (1.21-1) ...
update-alternatives: using /usr/bin/python2-jsondiff to provide /usr/bin/jsondiff (jsondiff) in auto mode
update-alternatives: using /usr/bin/python2-jsonpatch to provide /usr/bin/jsonpatch (jsonpatch) in auto mode
Setting up python-appdirs (1.4.3-1) ...
Setting up python-pymemcache (1.3.2-3) ...

        

open-iscsi

Release:cosmic
Architecture:amd64
Triggers:['open-iscsi/2.0.874-5ubuntu9.1']
Running for:1h 6m 16s
[  OK  ] Reached target Shutdown.
[  OK  ] Reached target Final Step.
         Starting Power-Off...
/shutdown: error while loading shared libraries: liblzma.so.5: cannot open shared object file: No such file or directory
[  925.465312] Kernel panic - not syncing: Attempted to kill init! exitcode=0x00007f00
[  925.465312] 
[  925.481481] CPU: 0 PID: 1 Comm: shutdown Not tainted 4.18.0-11-generic #12-Ubuntu
[  925.491530] Hardware name: QEMU Standard PC (i440FX + PIIX, 1996), BIOS 1.11.1-1ubuntu1 04/01/2014
[  925.503091] Call Trace:
[  925.512098]  dump_stack+0x63/0x83
[  925.516732]  panic+0xe7/0x247
[  925.520847]  do_exit.cold.23+0x55/0xc5
[  925.525946]  do_group_exit+0x43/0xb0
[  925.530466]  __x64_sys_exit_group+0x18/0x20
[  925.534557]  do_syscall_64+0x5a/0x110
[  925.538476]  entry_SYSCALL_64_after_hwframe+0x44/0xa9
[  925.545075] RIP: 0033:0x7f81b8b838d6
[  925.549457] Code: Bad RIP value.
[  925.555786] RSP: 002b:00007fff842204f8 EFLAGS: 00000206 ORIG_RAX: 00000000000000e7
[  925.563393] RAX: ffffffffffffffda RBX: 00007f81b8b8c228 RCX: 00007f81b8b838d6
[  925.570387] RDX: 000000000000007f RSI: 000000000000003c RDI: 000000000000007f
[  925.576510] RBP: 00007f81b82aee30 R08: 00000000000000e7 R09: 00000000ffffffff
[  925.577131] R10: 00007fff84220888 R11: 0000000000000206 R12: 000000000000000e
[  925.577724] R13: 00007f81b82aeed8 R14: 00007f81b82aee60 R15: 0000000000000000
[  925.581792] Kernel Offset: 0x3b400000 from 0xffffffff81000000 (relocation range: 0xffffffff80000000-0xffffffffbfffffff)
[  925.595267] ---[ end Kernel panic - not syncing: Attempted to kill init! exitcode=0x00007f00
[  925.595267]  ]---

        

openjdk-lts

Release:cosmic
Architecture:armhf
Triggers:['jtreg/4.2-b13-1ubuntu0.1']
Running for:2h 31m 39s
Passed: runtime/appcds/redefineClass/RedefineBasicTest.java
Passed: runtime/appcds/redefineClass/RedefineRunningMethods_Shared.java
Passed: runtime/appcds/sharedStrings/SysDictCrash.java
Passed: runtime/appcds/AppendClasspath.java
Passed: runtime/appcds/BootClassPathMismatch.java
Passed: runtime/appcds/jvmti/InstrumentationTest.java
Passed: runtime/appcds/CaseSensitiveClassPath.java
Passed: runtime/appcds/ClassLoaderTest.java
FAILED: runtime/appcds/CDSandJFR.java
Passed: runtime/appcds/ClassPathAttr.java
Passed: runtime/appcds/CommandLineFlagComboNegative.java
Passed: runtime/appcds/DirClasspathTest.java
Passed: runtime/appcds/DumpClassList.java
Passed: runtime/appcds/ExtraSymbols.java
Passed: runtime/appcds/FieldAnnotationsTest.java
Error:  runtime/appcds/FreeUnusedMetadata.java
Passed: runtime/appcds/HelloExtTest.java
Passed: runtime/appcds/HelloTest.java
Passed: runtime/appcds/CommandLineFlagCombo.java
Passed: runtime/appcds/IgnoreEmptyClassPaths.java
Passed: runtime/appcds/MismatchedUseAppCDS.java
Passed: runtime/appcds/MissingSuperTest.java
FAILED: runtime/appcds/MoveJDKTest.java
Passed: runtime/appcds/MultiProcessSharing.java
Passed: runtime/appcds/JvmtiAddPath.java
Passed: runtime/appcds/OldClassTest.java
Passed: runtime/appcds/MultiReleaseJars.java
Passed: runtime/appcds/ParallelLoad2.java
Passed: runtime/appcds/ParallelLoadTest.java
Passed: runtime/appcds/PrintSharedArchiveAndExit.java
Error:  runtime/appcds/ProhibitedPackage.java
Passed: runtime/appcds/ProtectionDomain.java
Passed: runtime/appcds/RewriteBytecodesTest.java
Passed: runtime/appcds/PackageSealing.java
Passed: runtime/appcds/SharedArchiveConsistency.java
Passed: runtime/appcds/SharedPackages.java
Passed: runtime/appcds/SignedJar.java
Passed: runtime/appcds/SpecifySysLoaderProp.java
Passed: runtime/appcds/TestWithProfiler.java
Passed: runtime/appcds/TraceLongClasspath.java
Passed: runtime/appcds/SharedBaseAddress.java
Passed: runtime/appcds/VerifierTest_0.java

        
Release:cosmic
Architecture:s390x
Triggers:['jtreg/4.2-b13-1ubuntu0.1']
Running for:15h 38m 46s
Passed: compiler/escapeAnalysis/Test6689060.java
Passed: compiler/escapeAnalysis/Test6726999.java
Passed: compiler/escapeAnalysis/Test6775880.java
Passed: compiler/escapeAnalysis/Test6895383.java
Passed: compiler/escapeAnalysis/Test6896727.java
Passed: compiler/escapeAnalysis/Test8020215.java
Passed: compiler/escapeAnalysis/TestAllocatedEscapesPtrComparison.java
Passed: compiler/escapeAnalysis/TestArrayCopy.java
Passed: compiler/escapeAnalysis/TestEABadMergeMem.java
Passed: compiler/escapeAnalysis/TestEscapeThroughInvoke.java
Passed: compiler/escapeAnalysis/TestUnsafePutAddressNullObjMustNotEscape.java
Passed: compiler/exceptions/CatchInlineExceptions.java
Passed: compiler/exceptions/SumTest.java
Passed: compiler/exceptions/TestC1ExceptionHandlersSameBCI.java
Passed: compiler/exceptions/TestRecursiveReplacedException.java
Passed: compiler/floatingpoint/ModNaN.java
Passed: compiler/floatingpoint/NaNTest.java
Error:  compiler/floatingpoint/TestFloatJNIArgs.java
Error:  compiler/floatingpoint/TestFloatSyncJNIArgs.java
Passed: compiler/floatingpoint/TestFMA.java
Passed: compiler/floatingpoint/TestFMABrokenC1RegAlloc.java
Passed: compiler/floatingpoint/TestPow2.java
Passed: compiler/floatingpoint/TestRound.java
Passed: compiler/gcbarriers/G1CrashTest.java
Passed: compiler/gcbarriers/PreserveFPRegistersTest.java
Passed: compiler/gcbarriers/TestMembarDependencies.java
Passed: compiler/inlining/DefaultAndConcreteMethodsCHA.java
Passed: compiler/inlining/DefaultMethodsDependencies.java
Passed: compiler/inlining/InlineAccessors.java
Passed: compiler/inlining/InlineDefaultMethod.java
Passed: compiler/inlining/InlineDefaultMethod1.java
Passed: compiler/integerArithmetic/TestIntegerComparison.java
Passed: compiler/interpreter/cr7116216/StackOverflow.java
Passed: compiler/interpreter/DisableOSRTest.java
Passed: compiler/interpreter/Test6539464.java
Passed: compiler/interpreter/Test6833129.java
Passed: compiler/interpreter/TestVerifyStackAfterDeopt.java

        
Release:cosmic
Architecture:ppc64el
Triggers:['jtreg/4.2-b13-1ubuntu0.1']
Running for:4h 2m 45s
Passed: jdk/javadoc/doclet/testWarnBadParamNames/TestWarnBadParamNames.java
FAILED: jdk/javadoc/doclet/testWarnings/TestWarnings.java
Passed: jdk/javadoc/doclet/testWindowTitle/TestWindowTitle.java
Passed: jdk/javadoc/doclet/testXOption/TestXOption.java
Passed: jdk/javadoc/doclet/typeAnnotations/smoke/TestSmoke.java
Passed: jdk/javadoc/doclet/ValidHtml/ValidHtml.java
Passed: jdk/javadoc/doclet/VersionNumber/VersionNumber.java
Passed: jdk/javadoc/doclet/WindowTitles/WindowTitles.java
Passed: jdk/javadoc/tool/6227454/Test.java
Passed: jdk/javadoc/tool/6942366/T6942366.java
Passed: jdk/javadoc/tool/6958836/Test.java
Passed: jdk/javadoc/tool/6964914/Test.java
Passed: jdk/javadoc/tool/6964914/TestStdDoclet.java
Passed: jdk/javadoc/tool/6964914/TestUserDoclet.java
Passed: jdk/javadoc/tool/8025693/Test.java
Passed: jdk/javadoc/tool/api/basic/AddModulesTest.java
Passed: jdk/javadoc/tool/api/basic/DocletPathTest.java
Passed: jdk/javadoc/tool/api/basic/DocumentationToolLocationTest.java
Passed: jdk/javadoc/tool/api/basic/GetSourceVersionsTest.java
Passed: jdk/javadoc/tool/api/basic/GetTask_DiagListenerTest.java
Passed: jdk/javadoc/tool/api/basic/GetTask_DocletClassTest.java
Passed: jdk/javadoc/tool/api/basic/GetTask_FileManagerTest.java
Passed: jdk/javadoc/tool/api/basic/GetTask_FileObjectsTest.java
Passed: jdk/javadoc/tool/api/basic/GetTask_OptionsTest.java
Passed: jdk/javadoc/tool/api/basic/GetTask_WriterTest.java
Passed: jdk/javadoc/tool/api/basic/IsSupportedOptionTest.java
Passed: jdk/javadoc/tool/api/basic/JavadocTaskImplTest.java
Passed: jdk/javadoc/tool/api/basic/RunTest.java
Passed: jdk/javadoc/tool/api/basic/TagletPathTest.java
Passed: jdk/javadoc/tool/api/basic/Task_reuseTest.java
Passed: jdk/javadoc/tool/api/TestName.java
Passed: jdk/javadoc/tool/badSuper/BadSuper.java
Passed: jdk/javadoc/tool/completionFailure/CompletionFailure.java
FAILED: jdk/javadoc/tool/doclint/DocLintTest.java
Passed: jdk/javadoc/tool/doclint/ImplicitHeadersTest.java

        
Release:cosmic
Architecture:armhf
Triggers:['jtreg/4.2-b13-1ubuntu0.2']
Ppas:['ubuntu-security-proposed/ppa']
Running for:3h 8m 42s
Passed: runtime/appcds/FieldAnnotationsTest.java
Passed: runtime/appcds/HelloTest.java
Passed: runtime/appcds/IgnoreEmptyClassPaths.java
Passed: runtime/appcds/JvmtiAddPath.java
Passed: runtime/appcds/MismatchedUseAppCDS.java
autopkgtest [19:30:47]: ERROR: timed out on command "su -s /bin/bash ubuntu -c set -e; export USER=`id -nu`; . /etc/profile >/dev/null 2>&1 || true;  . ~/.profile >/dev/null 2>&1 || true; buildtree="/tmp/autopkgtest.LJJOgj/build.1Rh/src"; mkdir -p -m 1777 -- "/tmp/autopkgtest.LJJOgj/hotspot-artifacts"; export AUTOPKGTEST_ARTIFACTS="/tmp/autopkgtest.LJJOgj/hotspot-artifacts"; export ADT_ARTIFACTS="$AUTOPKGTEST_ARTIFACTS"; mkdir -p -m 755 "/tmp/autopkgtest.LJJOgj/autopkgtest_tmp"; export AUTOPKGTEST_TMP="/tmp/autopkgtest.LJJOgj/autopkgtest_tmp"; export ADTTMP="$AUTOPKGTEST_TMP"; export DEBIAN_FRONTEND=noninteractive; export LANG=C.UTF-8; export DEB_BUILD_OPTIONS=parallel=4; unset LANGUAGE LC_CTYPE LC_NUMERIC LC_TIME LC_COLLATE   LC_MONETARY LC_MESSAGES LC_PAPER LC_NAME LC_ADDRESS   LC_TELEPHONE LC_MEASUREMENT LC_IDENTIFICATION LC_ALL;rm -f /tmp/autopkgtest_script_pid; set -C; echo $$ > /tmp/autopkgtest_script_pid; set +C; trap "rm -f /tmp/autopkgtest_script_pid" EXIT INT QUIT PIPE; cd "$buildtree"; export 'ADT_TEST_TRIGGERS=jtreg/4.2-b13-1ubuntu0.2'; chmod +x /tmp/autopkgtest.LJJOgj/build.1Rh/src/debian/tests/hotspot; touch /tmp/autopkgtest.LJJOgj/hotspot-stdout /tmp/autopkgtest.LJJOgj/hotspot-stderr; /tmp/autopkgtest.LJJOgj/build.1Rh/src/debian/tests/hotspot 2> >(tee -a /tmp/autopkgtest.LJJOgj/hotspot-stderr >&2) > >(tee -a /tmp/autopkgtest.LJJOgj/hotspot-stdout);" (kind: test)
autopkgtest [19:30:47]: test hotspot: -----------------------]
autopkgtest [19:30:52]: test hotspot:  - - - - - - - - - - results - - - - - - - - - -
hotspot              FAIL timed out
autopkgtest [19:30:52]: test hotspot:  - - - - - - - - - - stderr - - - - - - - - - -
Timeout refired 60 times
[2018-11-20 18:05:16,670] Agent[3]: Killing process

        
Release:cosmic
Architecture:s390x
Triggers:['jtreg/4.2-b13-1ubuntu0.2']
Ppas:['ubuntu-security-proposed/ppa']
Running for:5h 21m 31s
Passed: java/net/httpclient/websocket/PendingTextPongClose.java
Passed: java/net/httpclient/websocket/ReaderDriver.java
Passed: java/net/httpclient/websocket/SendTest.java
Passed: java/net/httpclient/websocket/WebSocketBuilderTest.java
Passed: java/net/httpclient/websocket/WebSocketExtendedTest.java
FAILED: java/net/httpclient/websocket/WebSocketTest.java
Passed: java/net/httpclient/websocket/WSHandshakeExceptionTest.java
Passed: java/net/httpclient/whitebox/AuthenticationFilterTestDriver.java
Passed: java/net/httpclient/whitebox/ConnectionPoolTestDriver.java
Passed: java/net/httpclient/whitebox/DefaultProxyDriver.java
Passed: java/net/httpclient/whitebox/DemandTestDriver.java
Passed: java/net/httpclient/whitebox/FlowTestDriver.java
Passed: java/net/httpclient/whitebox/FramesDecoderTestDriver.java
Passed: java/net/httpclient/whitebox/Http1HeaderParserTestDriver.java
Passed: java/net/httpclient/whitebox/MinimalFutureTestDriver.java
Passed: java/net/httpclient/whitebox/RawChannelTestDriver.java
Passed: java/net/httpclient/whitebox/SelectorTestDriver.java
Passed: java/net/httpclient/whitebox/SSLEchoTubeTestDriver.java
Passed: java/net/httpclient/whitebox/SSLTubeTestDriver.java
Passed: java/net/httpclient/whitebox/WindowControllerTestDriver.java
Passed: java/net/httpclient/whitebox/WrapperTestDriver.java
Passed: java/net/httpclient/AbstractThrowingPushPromises.java
Passed: java/net/httpclient/AsFileDownloadTest.java
Passed: java/net/httpclient/BasicAuthTest.java
Passed: java/net/httpclient/BasicRedirectTest.java
Passed: java/net/httpclient/BufferingSubscriberCancelTest.java
Passed: java/net/httpclient/BufferingSubscriberErrorCompleteTest.java
Passed: java/net/httpclient/BufferingSubscriberTest.java
Passed: java/net/httpclient/CancelledResponse.java
Passed: java/net/httpclient/ConcurrentResponses.java
Passed: java/net/httpclient/ConnectExceptionTest.java
Passed: java/net/httpclient/ConnectTimeoutHandshakeAsync.java

        
Release:cosmic
Architecture:ppc64el
Triggers:['jtreg/4.2-b13-1ubuntu0.2']
Ppas:['ubuntu-security-proposed/ppa']
Running for:2h 11m 54s
Passed: gc/g1/TestStringDeduplicationYoungGC.java
Passed: gc/g1/TestStringSymbolTableStats.java
Passed: gc/g1/TestVerifyGCType.java
Passed: gc/logging/TestDeprecatedPrintFlags.java
Passed: gc/logging/TestGCId.java
Passed: gc/logging/TestPrintReferences.java
Passed: gc/logging/TestUnifiedLoggingSwitchStress.java
Passed: gc/metaspace/G1AddMetaspaceDependency.java
Passed: gc/metaspace/TestCapacityUntilGCWrapAround.java
Passed: gc/metaspace/TestMetaspaceCMSCancel.java
Passed: gc/metaspace/TestMetaspaceInitialization.java
Passed: gc/metaspace/TestMetaspaceMemoryPool.java
Passed: gc/metaspace/TestMetaspacePerfCounters.java
Passed: gc/metaspace/TestMetaspaceSizeFlags.java
Passed: gc/metaspace/TestPerfCountersAndMemoryPools.java
Passed: gc/parallel/AdaptiveGCBoundary.java
Passed: gc/parallel/TestDynShrinkHeap.java
Passed: gc/parallel/TestPrintGCDetailsVerbose.java
Passed: gc/serial/HeapChangeLogging.java
Passed: gc/startup_warnings/TestCMS.java
Passed: gc/startup_warnings/TestG1.java
Passed: gc/startup_warnings/TestParallelGC.java
Passed: gc/startup_warnings/TestParallelScavengeSerialOld.java
Passed: gc/startup_warnings/TestSerialGC.java
Passed: gc/stress/gcbasher/TestGCBasherWithAllocateHeapAt.java
Passed: gc/stress/gcbasher/TestGCBasherWithCMS.java
Passed: gc/stress/gcbasher/TestGCBasherWithG1.java
Passed: gc/stress/gcbasher/TestGCBasherWithParallel.java
Passed: gc/stress/gcbasher/TestGCBasherWithSerial.java
Error:  gc/stress/gclocker/TestGCLockerWithCMS.java
Error:  gc/stress/gclocker/TestGCLockerWithSerial.java
Passed: gc/stress/gcold/TestGCOldWithCMS.java
Passed: gc/stress/gcold/TestGCOldWithG1.java
Passed: gc/stress/gcold/TestGCOldWithParallel.java
Passed: gc/stress/gcold/TestGCOldWithSerial.java
Passed: gc/stress/systemgc/TestSystemGCWithCMS.java
Passed: gc/stress/systemgc/TestSystemGCWithG1.java
Passed: gc/stress/systemgc/TestSystemGCWithParallel.java
Passed: gc/stress/systemgc/TestSystemGCWithSerial.java
Passed: gc/stress/TestReclaimStringsLeaksMemory.java

        

openssh

Release:cosmic
Architecture:amd64
Triggers:['openssh/1:7.7p1-4ubuntu0.1']
Running for:1h 30m 56s
19:37:47.523545300 E: + [ X = Xyes ]
19:37:47.525211762 E: + [ 21 -lt 1 ]
19:37:47.547369823 E: + verbose client rekey aes256-gcm@openssh.com ecdh-sha2-nistp521
19:37:47.549331645 E: + start_debug_log client rekey aes256-gcm@openssh.com ecdh-sha2-nistp521
19:37:47.567031507 E: + echo trace: client rekey aes256-gcm@openssh.com ecdh-sha2-nistp521
19:37:47.568962154 E: + echo trace: client rekey aes256-gcm@openssh.com ecdh-sha2-nistp521
19:37:47.583232948 E: + echo trace: client rekey aes256-gcm@openssh.com ecdh-sha2-nistp521
19:37:47.646127503 E: + [ X != Xyes ]
19:37:47.738247547 E: + echo client rekey aes256-gcm@openssh.com ecdh-sha2-nistp521
19:37:47.740283788 E: + ssh_data_rekeying KexAlgorithms=ecdh-sha2-nistp521 -oRekeyLimit=256k -oCiphers=aes256-gcm@openssh.com
19:37:47.784205230 E: + _kexopt=KexAlgorithms=ecdh-sha2-nistp521
19:37:47.853573141 E: + shift
19:37:47.855845284 E: + _opts=-oRekeyLimit=256k -oCiphers=aes256-gcm@openssh.com
19:37:47.869911775 E: + test -z 
19:37:47.879867760 E: + rm -f /tmp/autopkgtest.nhbRde/autopkgtest_tmp/user/tree/regress/copy /tmp/autopkgtest.nhbRde/autopkgtest_tmp/user/tree/regress/ssh.log
19:37:47.884542046 E: + _opts=-oRekeyLimit=256k -oCiphers=aes256-gcm@openssh.com -oCompression=no
19:37:47.937948774 E: + /tmp/autopkgtest.nhbRde/autopkgtest_tmp/user/tree/regress/ssh-log-wrapper.sh -oRekeyLimit=256k -oCiphers=aes256-gcm@openssh.com -oCompression=no -v -F /tmp/autopkgtest.nhbRde/autopkgtest_tmp/user/tree/regress/ssh_proxy somehost cat > /tmp/autopkgtest.nhbRde/autopkgtest_tmp/user/tree/regress/copy
19:37:51.250437001 E: + [ 0 -ne 0 ]
19:37:51.252579607 E: + cmp /tmp/autopkgtest.nhbRde/autopkgtest_tmp/user/tree/regress/data /tmp/autopkgtest.nhbRde/autopkgtest_tmp/user/tree/regress/copy
19:37:51.305662682 O: client rekey aes256-gcm@openssh.com curve25519-sha256
19:37:51.307348145 E: + wc -l
19:37:51.309951100 E: + grep NEWKEYS sent /tmp/autopkgtest.nhbRde/autopkgtest_tmp/user/tree/regress/ssh.log

        

resource-agents

Release:bionic
Architecture:i386
Triggers:['open-iscsi/2.0.874-5ubuntu2.4']
Running for:1h 15m 50s
Checking return value:        OK. The return value 'OCF_SUCCESS' == 'OCF_SUCCESS'

Starting 'LVM' case 8 'monitor when not running':
Setting agent environment:    export OCF_RESKEY_volgrpname=ocft-vg
Running agent:                ./LVM stop
Running agent:                ./LVM monitor
Checking return value:        OK. The return value 'OCF_NOT_RUNNING' == 'OCF_NOT_RUNNING'

Starting 'LVM' case 9 'unimplemented command':
Setting agent environment:    export OCF_RESKEY_volgrpname=ocft-vg
Running agent:                ./LVM no_cmd
Checking return value:        OK. The return value 'OCF_ERR_UNIMPLEMENTED' == 'OCF_ERR_UNIMPLEMENTED'

Cleaning 'LVM' ...
File descriptor 62 (pipe:[33154]) leaked on vgchange invocation. Parent PID 17140: /bin/bash
File descriptor 63 (pipe:[33150]) leaked on vgchange invocation. Parent PID 17140: /bin/bash
0 logical volume(s) in volume group "ocft-vg" now active
File descriptor 62 (pipe:[33154]) leaked on lvremove invocation. Parent PID 17140: /bin/bash
File descriptor 63 (pipe:[33150]) leaked on lvremove invocation. Parent PID 17140: /bin/bash
Logical volume "ocft-lv" successfully removed
File descriptor 62 (pipe:[33154]) leaked on vgremove invocation. Parent PID 17140: /bin/bash
File descriptor 63 (pipe:[33150]) leaked on vgremove invocation. Parent PID 17140: /bin/bash
Volume group "ocft-vg" successfully removed
File descriptor 62 (pipe:[33154]) leaked on pvremove invocation. Parent PID 17140: /bin/bash
File descriptor 63 (pipe:[33150]) leaked on pvremove invocation. Parent PID 17140: /bin/bash
Labels on physical volume "/dev/loop0" successfully wiped.
Done.

autopkgtest [19:35:14]: test command8: -----------------------]
autopkgtest [19:35:14]: test command8:  - - - - - - - - - - results - - - - - - - - - -
command8             PASS
autopkgtest [19:35:15]: test command9: preparing testbed

        
Release:bionic
Architecture:arm64
Triggers:['open-iscsi/2.0.874-5ubuntu2.4']
Running for:1h 5m 28s
Setting agent environment:    export OCF_RESKEY_directory=/run/resource-agents/ocft-Filesystem-mnt
Running agent:                ./Filesystem stop
Running agent:                ./Filesystem monitor
Checking return value:        OK. The return value 'OCF_NOT_RUNNING' == 'OCF_NOT_RUNNING'

Starting 'Filesystem' case 9 'monitor depth 10 when running':
Setting agent environment:    export OCF_RESKEY_device=/dev/loop0
Setting agent environment:    export OCF_RESKEY_fstype=ext3
Setting agent environment:    export OCF_RESKEY_directory=/run/resource-agents/ocft-Filesystem-mnt
Running agent:                ./Filesystem start
Setting agent environment:    export OCF_CHECK_LEVEL=10
Running agent:                ./Filesystem monitor
Checking return value:        OK. The return value 'OCF_SUCCESS' == 'OCF_SUCCESS'

Starting 'Filesystem' case 10 'monitor depth 20 with running':
Setting agent environment:    export OCF_RESKEY_device=/dev/loop0
Setting agent environment:    export OCF_RESKEY_fstype=ext3
Setting agent environment:    export OCF_RESKEY_directory=/run/resource-agents/ocft-Filesystem-mnt
Running agent:                ./Filesystem stop
Running agent:                ./Filesystem start
Setting agent environment:    export OCF_CHECK_LEVEL=20
Running agent:                ./Filesystem monitor
Checking return value:        OK. The return value 'OCF_SUCCESS' == 'OCF_SUCCESS'

Starting 'Filesystem' case 11 'start insert failure (remove device)':
Setting agent environment:    export OCF_RESKEY_device=/dev/loop0
Setting agent environment:    export OCF_RESKEY_fstype=ext3
Setting agent environment:    export OCF_RESKEY_directory=/run/resource-agents/ocft-Filesystem-mnt
Running agent:                ./Filesystem stop
Setting system environment:   losetup -d /dev/loop0
Running agent:                ./Filesystem start

        
Release:cosmic
Architecture:i386
Triggers:['open-iscsi/2.0.874-5ubuntu9.1']
Running for:1h 9m 40s
Setting up libpython2.7-stdlib:i386 (2.7.15-4ubuntu4) ...
Setting up libopenipmi0 (2.0.25-2ubuntu1) ...
Setting up libsnmp-base (5.7.3+dfsg-1.8ubuntu3.18.10.1) ...
Setting up libsnmp30:i386 (5.7.3+dfsg-1.8ubuntu3.18.10.1) ...
Setting up python2.7 (2.7.15-4ubuntu4) ...
Setting up python3-configshell-fb (1.1.20-2) ...
Setting up libpils2 (1.0.12-10) ...
Setting up libplumb2 (1.0.12-10) ...
Setting up libpython2-stdlib:i386 (2.7.15-3) ...
Setting up liblrm2 (1.0.12-10) ...
Setting up libstonith1 (1.0.12-10) ...
Setting up python2 (2.7.15-3) ...
Setting up libpython-stdlib:i386 (2.7.15-3) ...
Setting up cluster-glue (1.0.12-10) ...
Adding group `haclient' (GID 113) ...
Done.
Warning: The home dir /var/lib/pacemaker you specified can't be accessed: No such file or directory
Adding system user `hacluster' (UID 107) ...
Adding new user `hacluster' (UID 107) with group `haclient' ...
ERROR: ld.so: object 'libeatmydata.so' from LD_PRELOAD cannot be preloaded (cannot open shared object file): ignored.
Not creating home directory `/var/lib/pacemaker'.
Created symlink /etc/systemd/system/multi-user.target.wants/logd.service → /lib/systemd/system/logd.service.
Setting up python (2.7.15-3) ...
Setting up resource-agents (1:4.1.1-2) ...
[resource-agents.conf:1] Line references path below legacy directory /var/run/, updating /var/run/resource-agents/ → /run/resource-agents/; please update the tmpfiles.d/ drop-in file accordingly.
resource-agents-deps.target is a disabled or a static unit, not starting it.
Setting up python-six (1.11.0-2) ...
Setting up python-rtslib-fb (2.1.57+debian-4) ...
update-alternatives: using /usr/bin/targetctl-python2 to provide /usr/bin/targetctl (targetctl) in auto mode
Setting up python3-rtslib-fb (2.1.57+debian-4) ...
Setting up targetcli-fb (2.1.43-2) ...
Processing triggers for initramfs-tools (0.131ubuntu15) ...
update-initramfs: Generating /boot/initrd.img-4.18.0-11-generic

        
Release:cosmic
Architecture:arm64
Triggers:['open-iscsi/2.0.874-5ubuntu9.1']
Running for:0h 44m 6s
done
Setting up libpython3.6:arm64 (3.6.7-1~18.10) ...
Setting up libpython3-stdlib:arm64 (3.6.7-1~18.10) ...
Setting up python3 (3.6.7-1~18.10) ...
Setting up python3-cffi-backend (1.11.5-3ubuntu1) ...
Setting up grub-efi-arm64-signed (1.110+2.02+dfsg1-5ubuntu8) ...
Setting up python3-twisted-bin:arm64 (18.7.0-2) ...
Setting up plymouth-theme-ubuntu-text (0.9.3-1ubuntu10) ...
update-initramfs: deferring update (trigger activated)
Setting up policykit-1 (0.105-21) ...
Removed /run/systemd/system/polkit.service.
Setting up python3-click (6.7+git20180829-1) ...
Setting up cloud-initramfs-copymods (0.43ubuntu1) ...
Setting up gnupg (2.2.8-3ubuntu1) ...
Setting up libdpkg-perl (1.19.0.5ubuntu5) ...
Setting up python3-certifi (2018.8.24-1) ...
Setting up apparmor (2.12-4ubuntu8) ...
Installing new version of config file /etc/apparmor.d/abstractions/private-files ...
Installing new version of config file /etc/apparmor.d/abstractions/private-files-strict ...
Installing new version of config file /etc/apparmor.d/abstractions/ubuntu-browsers.d/user-files ...
Skipping profile in /etc/apparmor.d/disable: usr.sbin.rsyslogd
Setting up python3-newt:arm64 (0.52.20-6ubuntu1) ...
Setting up python3-pkg-resources (40.2.0-1) ...
Setting up python3-gi (3.30.1-1ubuntu1) ...
Setting up python3-netifaces (0.10.4-1build1) ...
Setting up libgssapi-krb5-2:arm64 (1.16-2ubuntu1) ...
Setting up python3-problem-report (2.20.10-0ubuntu13.1) ...
Setting up python3-blinker (1.4+dfsg1-0.2) ...
Setting up dpkg-dev (1.19.0.5ubuntu5) ...
Setting up python3-debconf (1.5.69) ...
Setting up python3-httplib2 (0.11.3-1) ...
Setting up python3-requests (2.18.4-2ubuntu0.18.10.1) ...
Setting up python3-gdbm:arm64 (3.6.7-1~18.10) ...
Setting up python3-twisted (18.7.0-2) ...
Setting up python3-configobj (5.0.6-3) ...
Setting up openssh-client (1:7.7p1-4) ...
Setting up python3-debian (0.1.33) ...
Setting up networkd-dispatcher (1.7-0ubuntu8) ...

        

snapcraft

Release:cosmic
Architecture:i386
Triggers:['openssh/1:7.7p1-4ubuntu0.1']
Running for:1h 13m 53s
test_store_validate.ValidateTestCase.test_validate_success ... ok
test_validate_unknown_snap_failure (test_store_validate.ValidateTestCase)
test_store_validate.ValidateTestCase.test_validate_unknown_snap_failure ... ok
test_whoami_must_print_email_and_developer_id (test_store_whoami.WhoamiTestCase)
test_store_whoami.WhoamiTestCase.test_whoami_must_print_email_and_developer_id ... ok

----------------------------------------------------------------------
Ran 60 tests in 467.765s

OK (skipped=2)
autopkgtest [19:34:54]: test integrationtests-store: -----------------------]
autopkgtest [19:34:55]: test integrationtests-store:  - - - - - - - - - - results - - - - - - - - - -
integrationtests-store PASS
autopkgtest [19:34:55]: test integrationtests-plugins: preparing testbed
Reading package lists...
Building dependency tree...
Reading state information...
Starting pkgProblemResolver with broken count: 0
Starting 2 pkgProblemResolver with broken count: 0
Done
0 upgraded, 0 newly installed, 0 to remove and 0 not upgraded.
1 not fully installed or removed.
After this operation, 0 B of additional disk space will be used.
Setting up autopkgtest-satdep (0) ...
(Reading database ... 70853 files and directories currently installed.)
Removing autopkgtest-satdep (0) ...
autopkgtest [19:35:01]: test integrationtests-plugins: [-----------------------
tests/integration/plugins
test_download_file_from_ftp_source (test_dump_plugin.DumpPluginTestCase)
test_dump_plugin.DumpPluginTestCase.test_download_file_from_ftp_source ... ok
test_download_file_with_content_encoding_set (test_dump_plugin.DumpPluginTestCase)
test_dump_plugin.DumpPluginTestCase.test_download_file_with_content_encoding_set ... ok
test_stage_dump_plugin (test_dump_plugin.DumpPluginTestCase)
test_dump_plugin.DumpPluginTestCase.test_stage_dump_plugin ... ok
test_snap (test_jhbuild_plugin.JHBuildPluginTestCase)
test_jhbuild_plugin.JHBuildPluginTestCase.test_snap ... 
        
Release:cosmic
Architecture:s390x
Triggers:['openssh/1:7.7p1-4ubuntu0.1']
Running for:0h 41m 47s
1 not fully installed or removed.
After this operation, 0 B of additional disk space will be used.
Setting up autopkgtest-satdep (0) ...
(Reading database ... 57586 files and directories currently installed.)
Removing autopkgtest-satdep (0) ...
autopkgtest [19:34:46]: test integrationtests-plugins: [-----------------------
tests/integration/plugins
test_download_file_from_ftp_source (test_dump_plugin.DumpPluginTestCase)
test_dump_plugin.DumpPluginTestCase.test_download_file_from_ftp_source ... ok
test_download_file_with_content_encoding_set (test_dump_plugin.DumpPluginTestCase)
test_dump_plugin.DumpPluginTestCase.test_download_file_with_content_encoding_set ... ok
test_stage_dump_plugin (test_dump_plugin.DumpPluginTestCase)
test_dump_plugin.DumpPluginTestCase.test_stage_dump_plugin ... ok
test_snap (test_jhbuild_plugin.JHBuildPluginTestCase)
test_jhbuild_plugin.JHBuildPluginTestCase.test_snap ... ok
test_clean (test_local_plugin.LocalPluginCleanTestCase)
test_local_plugin.LocalPluginCleanTestCase.test_clean (local-plugin) ... ok
test_clean (test_local_plugin.LocalPluginCleanTestCase)
test_local_plugin.LocalPluginCleanTestCase.test_clean (local-plugin-in-parts) ... ok
test_stage_local_plugin (test_local_plugin.LocalPluginTestCase)
test_local_plugin.LocalPluginTestCase.test_stage_local_plugin ... ok
test_stage_local_plugin_in_parts (test_local_plugin.LocalPluginTestCase)
test_local_plugin.LocalPluginTestCase.test_stage_local_plugin_in_parts ... ok
test_clean_make_plugin (test_make_plugin.MakePluginTestCase)
test_make_plugin.MakePluginTestCase.test_clean_make_plugin ... ok
test_make_can_rebuild (test_make_plugin.MakePluginTestCase)
test_make_plugin.MakePluginTestCase.test_make_can_rebuild ... ok
test_nonstandard_makefile (test_make_plugin.MakePluginTestCase)
test_make_plugin.MakePluginTestCase.test_nonstandard_makefile ... ok
test_stage_make_plugin (test_make_plugin.MakePluginTestCase)
test_make_plugin.MakePluginTestCase.test_stage_make_plugin ... 
        
Release:cosmic
Architecture:amd64
Triggers:['openssh/1:7.7p1-4ubuntu0.1']
Running for:1h 30m 56s
test_clean_make_plugin (test_make_plugin.MakePluginTestCase)
test_make_plugin.MakePluginTestCase.test_clean_make_plugin ... ok
test_make_can_rebuild (test_make_plugin.MakePluginTestCase)
test_make_plugin.MakePluginTestCase.test_make_can_rebuild ... ok
test_nonstandard_makefile (test_make_plugin.MakePluginTestCase)
test_make_plugin.MakePluginTestCase.test_nonstandard_makefile ... ok
test_stage_make_plugin (test_make_plugin.MakePluginTestCase)
test_make_plugin.MakePluginTestCase.test_stage_make_plugin ... ok
test_stage_make_with_artifacts (test_make_plugin.MakePluginTestCase)
test_make_plugin.MakePluginTestCase.test_stage_make_with_artifacts ... ok
test_stage (test_plainbox_provider_plugin.PlainboxProviderPluginStageTestCase)
test_plainbox_provider_plugin.PlainboxProviderPluginStageTestCase.test_stage (basic) ... ERROR
test_stage (test_plainbox_provider_plugin.PlainboxProviderPluginStageTestCase)
test_plainbox_provider_plugin.PlainboxProviderPluginStageTestCase.test_stage (with-stage-packages) ... ERROR
test_invalid_provider (test_plainbox_provider_plugin.PlainboxProviderPluginTestCase)
test_plainbox_provider_plugin.PlainboxProviderPluginTestCase.test_invalid_provider ... ok
test_python_stage_pkg_mix (test_plainbox_provider_plugin.PlainboxProviderPluginTestCase)
test_plainbox_provider_plugin.PlainboxProviderPluginTestCase.test_python_stage_pkg_mix ... ERROR
test_snap_provider_with_deps (test_plainbox_provider_plugin.PlainboxProviderPluginTestCase)
test_plainbox_provider_plugin.PlainboxProviderPluginTestCase.test_snap_provider_with_deps ... ERROR
test_prime (test_rust_plugin.RustPluginConfinementTestCase)
test_rust_plugin.RustPluginConfinementTestCase.test_prime (classic) ... ok
test_prime (test_rust_plugin.RustPluginConfinementTestCase)
test_rust_plugin.RustPluginConfinementTestCase.test_prime (strict) ... ok
test_cross_compiling (test_rust_plugin.RustPluginTestCase)
test_rust_plugin.RustPluginTestCase.test_cross_compiling ... 
        
Release:cosmic
Architecture:arm64
Triggers:['openssh/1:7.7p1-4ubuntu0.1']
Running for:1h 11m 13s
test_metadata_setuppy.SetupPyMetadataTestCase.test_version_metadata_from_yaml_description_collected ... ok
test_bad_multiarch_stage_packages (test_multiarch_stage_packages.MultiarchTestCase)
test_multiarch_stage_packages.MultiarchTestCase.test_bad_multiarch_stage_packages ... ok
test_no_system_libraries (test_no_system_libraries.NoSystemLibrariesTestCase)
test_no_system_libraries.NoSystemLibrariesTestCase.test_no_system_libraries ... ok
test_system_libraries (test_no_system_libraries.NoSystemLibrariesTestCase)
test_no_system_libraries.NoSystemLibrariesTestCase.test_system_libraries ... ok
test_parser_basic (test_parser.TestParser)
test_parser.TestParser.test_parser_basic ... ok
test_local_wiki (test_parser.TestParserWikis)
test_parser.TestParserWikis.test_local_wiki (Hidden .snapcraft.yaml file) ... ok
test_local_wiki (test_parser.TestParserWikis)
test_parser.TestParserWikis.test_local_wiki (Both snapcraft.yaml and .snapcraft.yaml files) ... ok
test_local_wiki (test_parser.TestParserWikis)
test_parser.TestParserWikis.test_local_wiki (snap/snapcraft.yaml) ... ok
test_local_wiki (test_parser.TestParserWikis)
test_parser.TestParserWikis.test_local_wiki (Missing .snapcraft.yaml file) ... ok
test_local_wiki (test_parser.TestParserWikis)
test_parser.TestParserWikis.test_local_wiki (Origin type, branch and commit options) ... ok
test_local_wiki (test_parser.TestParserWikis)
test_parser.TestParserWikis.test_local_wiki (Origin type, branch and commit options (wrong values)) ... ok
test_curl_exists_and_properly_defined (test_parts.PartsTestCase)
test_parts.PartsTestCase.test_curl_exists_and_properly_defined ... ok
test_update (test_parts.PartsTestCase)
test_parts.PartsTestCase.test_update ... ok
test_part_with_fileset (test_parts.PartsWithFilesetsTestCase)
test_parts.PartsWithFilesetsTestCase.test_part_with_fileset ... ok
test_pkgconfig_pc_conflicts_1604472 (test_pkg_config.PkgConfigTestCase)
test_pkg_config.PkgConfigTestCase.test_pkgconfig_pc_conflicts_1604472 ... 
        
Release:cosmic
Architecture:ppc64el
Triggers:['openssh/1:7.7p1-4ubuntu0.1']
Running for:1h 30m 53s
ShmemHugePages:        0 kB
ShmemPmdMapped:        0 kB
CmaTotal:              0 kB
CmaFree:               0 kB
+ printf %s\n -950
+ cat /proc/meminfo
+ chpasswd
+ echo ubuntu:ubuntu
+ sed -i s/\(PermitRootLogin\|PasswordAuthentication\)\>.*/\1 yes/ /etc/ssh/sshd_config
+ systemctl reload sshd.service
+ snap install --classic go
go 1.11.2 from Michael Hudson-Doyle (mwhudson) installed
+ export GOPATH=/tmp/go
+ /snap/bin/go get -u github.com/snapcore/spread/cmd/spread
+ sudo snap remove go
go removed
+ . /etc/os-release
+ NAME=Ubuntu
+ VERSION=18.10 (Cosmic Cuttlefish)
+ ID=ubuntu
+ ID_LIKE=debian
+ PRETTY_NAME=Ubuntu 18.10
+ VERSION_ID=18.10
+ HOME_URL=https://www.ubuntu.com/
+ SUPPORT_URL=https://help.ubuntu.com/
+ BUG_REPORT_URL=https://bugs.launchpad.net/ubuntu/
+ PRIVACY_POLICY_URL=https://www.ubuntu.com/legal/terms-and-policies/privacy-policy
+ VERSION_CODENAME=cosmic
+ UBUNTU_CODENAME=cosmic
+ export SNAPCRAFT_PACKAGE_TYPE=deb
+ dpkg --print-architecture
+ /tmp/go/bin/spread -v autopkgtest:ubuntu-18.10-ppc64el
2018-11-20 19:37:42 Found /tmp/autopkgtest.2wngfA/build.cB1/src/spread.yaml.
2018-11-20 19:37:42 Project content is packed for delivery (11.31MB).
2018-11-20 19:37:42 Sequence of jobs produced with -seed=1542742662
2018-11-20 19:37:42 If killed, discard servers with: spread -reuse-pid=3659 -discard
2018-11-20 19:37:42 Allocating autopkgtest:ubuntu-18.10-ppc64el...
2018-11-20 19:37:42 Waiting for autopkgtest:ubuntu-18.10-ppc64el to make SSH available at localhost:22...
2018-11-20 19:37:42 Allocated autopkgtest:ubuntu-18.10-ppc64el.
2018-11-20 19:37:42 Connecting to autopkgtest:ubuntu-18.10-ppc64el...
2018-11-20 19:37:42 Connected to autopkgtest:ubuntu-18.10-ppc64el at localhost:22.
2018-11-20 19:37:42 Sending project content to autopkgtest:ubuntu-18.10-ppc64el...
2018-11-20 19:37:43 Preparing autopkgtest:ubuntu-18.10-ppc64el...
2018-11-20 19:37:46 Executing autopkgtest:ubuntu-18.10-ppc64el:tests/spread/plugins/catkin/run (1/25)...

        

snapd

Release:cosmic
Architecture:i386
Triggers:['openssh/1:7.7p1-4ubuntu0.1']
Running for:1h 13m 40s
2018-11-20 19:36:00 Restoring autopkgtest:ubuntu-18.10-i386:tests/main/interfaces-dvb...
2018-11-20 19:36:00 Preparing autopkgtest:ubuntu-18.10-i386:tests/main/interfaces-content-mkdir-writable:common...
2018-11-20 19:36:13 Executing autopkgtest:ubuntu-18.10-i386:tests/main/interfaces-content-mkdir-writable:common (157/279)...
2018-11-20 19:36:16 Restoring autopkgtest:ubuntu-18.10-i386:tests/main/interfaces-content-mkdir-writable:common...
2018-11-20 19:36:16 Preparing autopkgtest:ubuntu-18.10-i386:tests/main/interfaces-network-setup-observe...
2018-11-20 19:36:29 Executing autopkgtest:ubuntu-18.10-i386:tests/main/interfaces-network-setup-observe (158/279)...
2018-11-20 19:36:34 Restoring autopkgtest:ubuntu-18.10-i386:tests/main/interfaces-network-setup-observe...
2018-11-20 19:36:34 Preparing autopkgtest:ubuntu-18.10-i386:tests/main/interfaces-time-control...
2018-11-20 19:36:45 Executing autopkgtest:ubuntu-18.10-i386:tests/main/interfaces-time-control (159/279)...
2018-11-20 19:36:52 Restoring autopkgtest:ubuntu-18.10-i386:tests/main/interfaces-time-control...
2018-11-20 19:36:52 Preparing autopkgtest:ubuntu-18.10-i386:tests/main/security-profiles...
2018-11-20 19:37:04 Executing autopkgtest:ubuntu-18.10-i386:tests/main/security-profiles (160/279)...
2018-11-20 19:37:08 Restoring autopkgtest:ubuntu-18.10-i386:tests/main/security-profiles...
2018-11-20 19:37:08 Preparing autopkgtest:ubuntu-18.10-i386:tests/main/snap-run...
2018-11-20 19:37:25 Executing autopkgtest:ubuntu-18.10-i386:tests/main/snap-run (161/279)...
2018-11-20 19:37:27 Restoring autopkgtest:ubuntu-18.10-i386:tests/main/snap-run...
2018-11-20 19:37:27 Preparing autopkgtest:ubuntu-18.10-i386:tests/main/install-cache...
2018-11-20 19:37:38 Executing autopkgtest:ubuntu-18.10-i386:tests/main/install-cache (162/279)...
2018-11-20 19:37:46 Restoring autopkgtest:ubuntu-18.10-i386:tests/main/install-cache...
2018-11-20 19:37:46 Preparing autopkgtest:ubuntu-18.10-i386:tests/main/interfaces-kvm...

        
Release:cosmic
Architecture:s390x
Triggers:['openssh/1:7.7p1-4ubuntu0.1']
Running for:0h 39m 35s
2018-11-20 19:36:42 Restoring autopkgtest:ubuntu-18.10-s390x:tests/main/interfaces-desktop...
2018-11-20 19:36:42 Preparing autopkgtest:ubuntu-18.10-s390x:tests/main/refresh-delta...
2018-11-20 19:36:50 Executing autopkgtest:ubuntu-18.10-s390x:tests/main/refresh-delta (116/273)...
2018-11-20 19:36:54 Restoring autopkgtest:ubuntu-18.10-s390x:tests/main/refresh-delta...
2018-11-20 19:36:54 Preparing autopkgtest:ubuntu-18.10-s390x:tests/main/install-refresh-private...
2018-11-20 19:36:58 Executing autopkgtest:ubuntu-18.10-s390x:tests/main/install-refresh-private (117/273)...
2018-11-20 19:36:59 Restoring autopkgtest:ubuntu-18.10-s390x:tests/main/install-refresh-private...
2018-11-20 19:36:59 Preparing autopkgtest:ubuntu-18.10-s390x:tests/main/snap-system-key...
2018-11-20 19:37:03 Executing autopkgtest:ubuntu-18.10-s390x:tests/main/snap-system-key (118/273)...
2018-11-20 19:37:18 Restoring autopkgtest:ubuntu-18.10-s390x:tests/main/snap-system-key...
2018-11-20 19:37:18 Preparing autopkgtest:ubuntu-18.10-s390x:tests/main/snap-confine...
2018-11-20 19:37:27 Executing autopkgtest:ubuntu-18.10-s390x:tests/main/snap-confine (119/273)...
2018-11-20 19:37:28 Restoring autopkgtest:ubuntu-18.10-s390x:tests/main/snap-confine...
2018-11-20 19:37:28 Preparing autopkgtest:ubuntu-18.10-s390x:tests/main/interfaces-daemon-notify...
2018-11-20 19:37:34 Executing autopkgtest:ubuntu-18.10-s390x:tests/main/interfaces-daemon-notify (120/273)...
2018-11-20 19:37:36 Restoring autopkgtest:ubuntu-18.10-s390x:tests/main/interfaces-daemon-notify...
2018-11-20 19:37:36 Preparing autopkgtest:ubuntu-18.10-s390x:tests/main/security-apparmor...
2018-11-20 19:37:42 Executing autopkgtest:ubuntu-18.10-s390x:tests/main/security-apparmor (121/273)...
2018-11-20 19:37:42 Restoring autopkgtest:ubuntu-18.10-s390x:tests/main/security-apparmor...
2018-11-20 19:37:42 Preparing autopkgtest:ubuntu-18.10-s390x:tests/main/completion...

        
Release:cosmic
Architecture:amd64
Triggers:['openssh/1:7.7p1-4ubuntu0.1']
Running for:0h 49m 25s
2018-11-20 19:35:20 Restoring autopkgtest:ubuntu-18.10-amd64:tests/main/snap-confine-privs...
2018-11-20 19:35:20 Preparing autopkgtest:ubuntu-18.10-amd64:tests/main/refresh-devmode:fake...
2018-11-20 19:35:34 Executing autopkgtest:ubuntu-18.10-amd64:tests/main/refresh-devmode:fake (112/280)...
2018-11-20 19:35:37 Restoring autopkgtest:ubuntu-18.10-amd64:tests/main/refresh-devmode:fake...
2018-11-20 19:35:38 Preparing autopkgtest:ubuntu-18.10-amd64:tests/main/interfaces-network-control-ip-netns...
2018-11-20 19:35:50 Executing autopkgtest:ubuntu-18.10-amd64:tests/main/interfaces-network-control-ip-netns (113/280)...
2018-11-20 19:35:51 Restoring autopkgtest:ubuntu-18.10-amd64:tests/main/interfaces-network-control-ip-netns...
2018-11-20 19:35:52 Preparing autopkgtest:ubuntu-18.10-amd64:tests/main/interfaces-content-mkdir-writable:snap...
2018-11-20 19:36:03 Executing autopkgtest:ubuntu-18.10-amd64:tests/main/interfaces-content-mkdir-writable:snap (114/280)...
2018-11-20 19:36:06 Restoring autopkgtest:ubuntu-18.10-amd64:tests/main/interfaces-content-mkdir-writable:snap...
2018-11-20 19:36:06 Preparing autopkgtest:ubuntu-18.10-amd64:tests/main/classic-firstboot...
2018-11-20 19:36:32 Executing autopkgtest:ubuntu-18.10-amd64:tests/main/classic-firstboot (115/280)...
2018-11-20 19:36:42 Restoring autopkgtest:ubuntu-18.10-amd64:tests/main/classic-firstboot...
2018-11-20 19:36:42 Preparing autopkgtest:ubuntu-18.10-amd64:tests/main/static...
2018-11-20 19:36:52 Executing autopkgtest:ubuntu-18.10-amd64:tests/main/static (116/280)...
2018-11-20 19:37:26 Restoring autopkgtest:ubuntu-18.10-amd64:tests/main/static...
2018-11-20 19:37:26 Preparing autopkgtest:ubuntu-18.10-amd64:tests/main/op-remove...
2018-11-20 19:37:34 Executing autopkgtest:ubuntu-18.10-amd64:tests/main/op-remove (117/280)...
2018-11-20 19:37:44 Restoring autopkgtest:ubuntu-18.10-amd64:tests/main/op-remove...
2018-11-20 19:37:44 Preparing autopkgtest:ubuntu-18.10-amd64:tests/main/snap-disconnect...

        
Release:cosmic
Architecture:arm64
Triggers:['openssh/1:7.7p1-4ubuntu0.1']
Running for:0h 54m 57s
2018-11-20 19:34:44 Executing autopkgtest:ubuntu-18.10-arm64:tests/main/interfaces-network-control (23/280)...
2018-11-20 19:34:54 Restoring autopkgtest:ubuntu-18.10-arm64:tests/main/interfaces-network-control...
2018-11-20 19:34:55 Preparing autopkgtest:ubuntu-18.10-arm64:tests/main/interfaces-snapd-control-with-manage...
2018-11-20 19:35:23 Executing autopkgtest:ubuntu-18.10-arm64:tests/main/interfaces-snapd-control-with-manage (24/280)...
2018-11-20 19:35:32 Restoring autopkgtest:ubuntu-18.10-arm64:tests/main/interfaces-snapd-control-with-manage...
2018-11-20 19:35:35 Preparing autopkgtest:ubuntu-18.10-arm64:tests/main/interfaces-browser-support:disallow...
2018-11-20 19:35:58 Executing autopkgtest:ubuntu-18.10-arm64:tests/main/interfaces-browser-support:disallow (25/280)...
2018-11-20 19:36:04 Restoring autopkgtest:ubuntu-18.10-arm64:tests/main/interfaces-browser-support:disallow...
2018-11-20 19:36:04 Preparing autopkgtest:ubuntu-18.10-arm64:tests/main/cgroup-freezer...
2018-11-20 19:36:27 Executing autopkgtest:ubuntu-18.10-arm64:tests/main/cgroup-freezer (26/280)...
2018-11-20 19:36:28 Restoring autopkgtest:ubuntu-18.10-arm64:tests/main/cgroup-freezer...
2018-11-20 19:36:28 Preparing autopkgtest:ubuntu-18.10-arm64:tests/main/interfaces-removable-media...
2018-11-20 19:36:53 Executing autopkgtest:ubuntu-18.10-arm64:tests/main/interfaces-removable-media (27/280)...
2018-11-20 19:36:56 Restoring autopkgtest:ubuntu-18.10-arm64:tests/main/interfaces-removable-media...
2018-11-20 19:36:56 Preparing autopkgtest:ubuntu-18.10-arm64:tests/main/install-refresh-remove-hooks...
2018-11-20 19:37:16 Executing autopkgtest:ubuntu-18.10-arm64:tests/main/install-refresh-remove-hooks (28/280)...
2018-11-20 19:37:42 Restoring autopkgtest:ubuntu-18.10-arm64:tests/main/install-refresh-remove-hooks...
2018-11-20 19:37:42 Preparing autopkgtest:ubuntu-18.10-arm64:tests/main/debug-sandbox...

        

systemd-upstream

Release:bionic
Architecture:amd64
Env:['CFLAGS=-O0', 'DEB_BUILD_PROFILES=noudeb', 'TEST_UPSTREAM=1', 'UPSTREAM_PULL_REQUEST=10857', 'GITHUB_STATUSES_URL=https://api.github.com/repos/systemd/systemd/statuses/ab84ad956e965b497998e9775f2b204d2bbc254f']
Ppas:['pitti/systemd-semaphore']
Build-git:https://salsa.debian.org/systemd-team/systemd.git
Running for:3h 47m 49s
+ sd_device_ref@LIBSYSTEMD_240 239-2568-g6e7bc6a5b-0
+ sd_device_set_sysattr_value@LIBSYSTEMD_240 239-2568-g6e7bc6a5b-0
+ sd_device_unref@LIBSYSTEMD_240 239-2568-g6e7bc6a5b-0
  sd_event_add_child@LIBSYSTEMD_221 221
  sd_event_add_defer@LIBSYSTEMD_221 221
  sd_event_add_exit@LIBSYSTEMD_221 221
@@ -326,6 +393,7 @@
  sd_event_source_get_destroy_callback@LIBSYSTEMD_239 239
  sd_event_source_get_enabled@LIBSYSTEMD_221 221
  sd_event_source_get_event@LIBSYSTEMD_221 221
+ sd_event_source_get_floating@LIBSYSTEMD_240 239-2568-g6e7bc6a5b-0
  sd_event_source_get_inotify_mask@LIBSYSTEMD_239 239
  sd_event_source_get_io_events@LIBSYSTEMD_221 221
  sd_event_source_get_io_fd@LIBSYSTEMD_221 221
@@ -342,6 +410,7 @@
  sd_event_source_set_description@LIBSYSTEMD_221 221
  sd_event_source_set_destroy_callback@LIBSYSTEMD_239 239
  sd_event_source_set_enabled@LIBSYSTEMD_221 221
+ sd_event_source_set_floating@LIBSYSTEMD_240 239-2568-g6e7bc6a5b-0
  sd_event_source_set_io_events@LIBSYSTEMD_221 221
  sd_event_source_set_io_fd@LIBSYSTEMD_221 221
  sd_event_source_set_io_fd_own@LIBSYSTEMD_237 237
@@ -357,8 +426,15 @@
  sd_get_seats@LIBSYSTEMD_209 0
  sd_get_sessions@LIBSYSTEMD_209 0
  sd_get_uids@LIBSYSTEMD_209 0
+ sd_hwdb_enumerate@LIBSYSTEMD_240 239-2568-g6e7bc6a5b-0
+ sd_hwdb_get@LIBSYSTEMD_240 239-2568-g6e7bc6a5b-0
+ sd_hwdb_new@LIBSYSTEMD_240 239-2568-g6e7bc6a5b-0
+ sd_hwdb_ref@LIBSYSTEMD_240 239-2568-g6e7bc6a5b-0
+ sd_hwdb_seek@LIBSYSTEMD_240 239-2568-g6e7bc6a5b-0
+ sd_hwdb_unref@LIBSYSTEMD_240 239-2568-g6e7bc6a5b-0
  sd_id128_from_string@LIBSYSTEMD_209 0
  sd_id128_get_boot@LIBSYSTEMD_209 0
+ sd_id128_get_boot_app_specific@LIBSYSTEMD_240 239-2568-g6e7bc6a5b-0
  sd_id128_get_invocation@LIBSYSTEMD_232 232
  sd_id128_get_machine@LIBSYSTEMD_209 0
  sd_id128_get_machine_app_specific@LIBSYSTEMD_233 233
make[1]: Leaving directory '/tmp/autopkgtest.K2kmnz/build.lpL/systemd'
   debian/rules override_dh_shlibdeps
make[1]: Entering directory '/tmp/autopkgtest.K2kmnz/build.lpL/systemd'

        
Release:bionic
Architecture:arm64
Env:['CFLAGS=-O0', 'DEB_BUILD_PROFILES=noudeb', 'TEST_UPSTREAM=1', 'UPSTREAM_PULL_REQUEST=10357', 'GITHUB_STATUSES_URL=https://api.github.com/repos/systemd/systemd/statuses/db4fa0477ea245bfbed581379bbb2d160e69b7ce']
Ppas:['pitti/systemd-semaphore']
Build-git:https://salsa.debian.org/systemd-team/systemd.git
Running for:2h 31m 35s

        
Release:bionic
Architecture:i386
Env:['CFLAGS=-O0', 'DEB_BUILD_PROFILES=noudeb', 'TEST_UPSTREAM=1', 'UPSTREAM_PULL_REQUEST=10861', 'GITHUB_STATUSES_URL=https://api.github.com/repos/systemd/systemd/statuses/6fec0c3382512ba6a329f8685f40d11b0071bf47']
Ppas:['pitti/systemd-semaphore']
Build-git:https://salsa.debian.org/systemd-team/systemd.git
Running for:1h 45m 45s
Preparing to unpack .../14-python3-update-manager_1%3a18.04.11.7_all.deb ...
Unpacking python3-update-manager (1:18.04.11.7) over (1:18.04.11.6) ...
Preparing to unpack .../15-linux-firmware_1.173.2_all.deb ...
Unpacking linux-firmware (1.173.2) over (1.173.1) ...
Setting up libpython3.6-stdlib:i386 (3.6.7-1~18.04) ...
Setting up libisc169:i386 (1:9.11.3+dfsg-1ubuntu1.3) ...
Setting up libnss-systemd:i386 (237-3ubuntu10.9) ...
Setting up libisccc160:i386 (1:9.11.3+dfsg-1ubuntu1.3) ...
Setting up python3.6 (3.6.7-1~18.04) ...
Processing triggers for mime-support (3.60ubuntu1) ...
Setting up libisc-export169:i386 (1:9.11.3+dfsg-1ubuntu1.3) ...
Setting up systemd-sysv (237-3ubuntu10.9) ...
Processing triggers for libc-bin (2.27-3ubuntu1) ...
Setting up udev (237-3ubuntu10.9) ...
update-initramfs: deferring update (trigger activated)
Setting up libdns-export1100 (1:9.11.3+dfsg-1ubuntu1.3) ...
Processing triggers for man-db (2.8.3-2ubuntu0.1) ...
Processing triggers for dbus (1.12.2-1ubuntu1) ...
Setting up libdns1100:i386 (1:9.11.3+dfsg-1ubuntu1.3) ...
Setting up linux-firmware (1.173.2) ...
update-initramfs: Generating /boot/initrd.img-4.15.0-39-generic
Setting up liblwres160:i386 (1:9.11.3+dfsg-1ubuntu1.3) ...
Setting up libpython3.6:i386 (3.6.7-1~18.04) ...
Setting up libpython3-stdlib:i386 (3.6.7-1~18.04) ...
Setting up libpam-systemd:i386 (237-3ubuntu10.9) ...
Setting up python3 (3.6.7-1~18.04) ...
Setting up python3-update-manager (1:18.04.11.7) ...
Setting up libisccfg160:i386 (1:9.11.3+dfsg-1ubuntu1.3) ...
Setting up python3-gdbm:i386 (3.6.7-1~18.04) ...
Setting up libirs160:i386 (1:9.11.3+dfsg-1ubuntu1.3) ...
Setting up libbind9-160:i386 (1:9.11.3+dfsg-1ubuntu1.3) ...
Setting up bind9-host (1:9.11.3+dfsg-1ubuntu1.3) ...
Setting up dnsutils (1:9.11.3+dfsg-1ubuntu1.3) ...
Processing triggers for initramfs-tools (0.130ubuntu3.5) ...
update-initramfs: Generating /boot/initrd.img-4.15.0-39-generic

        
Release:bionic
Architecture:amd64
Env:['CFLAGS=-O0', 'DEB_BUILD_PROFILES=noudeb', 'TEST_UPSTREAM=1', 'UPSTREAM_PULL_REQUEST=10861', 'GITHUB_STATUSES_URL=https://api.github.com/repos/systemd/systemd/statuses/6fec0c3382512ba6a329f8685f40d11b0071bf47']
Ppas:['pitti/systemd-semaphore']
Build-git:https://salsa.debian.org/systemd-team/systemd.git
Running for:1h 45m 45s
Setting up libpython3.6-stdlib:amd64 (3.6.7-1~18.04) ...
Setting up libisc169:amd64 (1:9.11.3+dfsg-1ubuntu1.3) ...
Setting up libnss-systemd:amd64 (237-3ubuntu10.9) ...
Setting up libisccc160:amd64 (1:9.11.3+dfsg-1ubuntu1.3) ...
Setting up python3.6 (3.6.7-1~18.04) ...
Processing triggers for mime-support (3.60ubuntu1) ...
Setting up libisc-export169:amd64 (1:9.11.3+dfsg-1ubuntu1.3) ...
Setting up systemd-sysv (237-3ubuntu10.9) ...
Processing triggers for libc-bin (2.27-3ubuntu1) ...
Setting up udev (237-3ubuntu10.9) ...
update-initramfs: deferring update (trigger activated)
Setting up libdns-export1100 (1:9.11.3+dfsg-1ubuntu1.3) ...
Processing triggers for man-db (2.8.3-2ubuntu0.1) ...
Processing triggers for dbus (1.12.2-1ubuntu1) ...
Setting up libdns1100:amd64 (1:9.11.3+dfsg-1ubuntu1.3) ...
Setting up linux-firmware (1.173.2) ...
update-initramfs: Generating /boot/initrd.img-4.15.0-39-generic
Setting up liblwres160:amd64 (1:9.11.3+dfsg-1ubuntu1.3) ...
Setting up libpython3.6:amd64 (3.6.7-1~18.04) ...
Setting up libpython3-stdlib:amd64 (3.6.7-1~18.04) ...
Setting up libpam-systemd:amd64 (237-3ubuntu10.9) ...
Setting up python3 (3.6.7-1~18.04) ...
Setting up python3-update-manager (1:18.04.11.7) ...
Setting up libisccfg160:amd64 (1:9.11.3+dfsg-1ubuntu1.3) ...
Setting up python3-gdbm:amd64 (3.6.7-1~18.04) ...
Setting up libirs160:amd64 (1:9.11.3+dfsg-1ubuntu1.3) ...
Setting up libbind9-160:amd64 (1:9.11.3+dfsg-1ubuntu1.3) ...
Setting up bind9-host (1:9.11.3+dfsg-1ubuntu1.3) ...
Setting up dnsutils (1:9.11.3+dfsg-1ubuntu1.3) ...
Processing triggers for initramfs-tools (0.130ubuntu3.5) ...
update-initramfs: Generating /boot/initrd.img-4.15.0-39-generic
Processing triggers for libc-bin (2.27-3ubuntu1) ...
autopkgtest [19:37:32]: rebooting testbed after setup commands that affected boot
Exit request sent.
autopkgtest-virt-ssh: WARNING: ssh connection failed. Retrying in 3 seconds...

        
Release:bionic
Architecture:arm64
Env:['CFLAGS=-O0', 'DEB_BUILD_PROFILES=noudeb', 'TEST_UPSTREAM=1', 'UPSTREAM_PULL_REQUEST=10851', 'GITHUB_STATUSES_URL=https://api.github.com/repos/systemd/systemd/statuses/db4e3c0b50f7f26bc60e471ad4497315c87b5480']
Ppas:['pitti/systemd-semaphore']
Build-git:https://salsa.debian.org/systemd-team/systemd.git
Running for:8h 10m 14s

        
Release:bionic
Architecture:i386
Env:['CFLAGS=-O0', 'DEB_BUILD_PROFILES=noudeb', 'TEST_UPSTREAM=1', 'UPSTREAM_PULL_REQUEST=10857', 'GITHUB_STATUSES_URL=https://api.github.com/repos/systemd/systemd/statuses/af4438e86ddef4ea7b81713a14945d0b110649c2']
Ppas:['pitti/systemd-semaphore']
Build-git:https://salsa.debian.org/systemd-team/systemd.git
Running for:4h 29m 13s
test-journal-syslog
test-journal-verify
test-json
test-keymap-util
test-libsystemd-sym
test-libudev
test-libudev-sym
test-list
test-lldp
test-local-addresses
test-locale-util
test-log
test-login
test-login-shared
test-login-tables
test-loopback
test-machine-tables
test-mmap-cache
test-mount-util
test-namespace
test-ndisc-ra
test-ndisc-rs
test-netlink
test-network
test-network-tables
test-networkd-conf
test-nspawn-tables
test-os-util
test-parse-util
test-path
test-path-lookup
test-path-util
test-prioq
test-proc-cmdline
test-process-util
test-procfs-util
test-random-util
test-ratelimit
test-replace-var
test-resolve
test-resolve-tables
test-resolved-etc-hosts
test-resolved-packet
test-rlimit-util
test-routing-policy-rule
test-sched-prio
test-sd-device
test-sd-device-monitor
test-sd-device-thread
test-sd-dhcp-lease
test-sd-hwdb
test-seccomp
test-selinux
test-serialize
test-set
test-set-disable-mempool
test-sigbus
test-signal-util
test-siphash24
test-sizeof
test-sleep
test-socket-util
test-specifier
test-stat-util
test-strbuf
test-string-util
test-strip-tab-ansi
test-strv
test-strxcpyx
test-tables
test-terminal-util
test-time-util
test-timesync
test-tmpfiles
test-udev-device-thread
test-uid-range
test-umount
test-unaligned
test-unit-file
test-unit-name
test-user-util
test-utf8
test-util
test-verbs
test-watch-pid
test-watchdog
test-web-util
test-xattr-util
test-xml
TEST RUN: Run unit tests under containers [OK]
objdump: '/tmp/autopkgtest.qKuQUv/build.fYh/systemd/test/TEST-24-UNIT-TESTS/systemd': No such file
TEST CLEANUP: Run unit tests under containers
make: Leaving directory '/tmp/autopkgtest.qKuQUv/build.fYh/systemd/test/TEST-24-UNIT-TESTS'

FAILED TESTS:  test/TEST-17-UDEV-WANTS test/TEST-19-DELEGATE
autopkgtest [19:37:19]: test upstream: -----------------------]
autopkgtest [19:37:19]: test upstream:  - - - - - - - - - - results - - - - - - - - - -
upstream             FAIL non-zero exit status 1
autopkgtest [19:37:21]: test boot-smoke: preparing testbed

        
Release:bionic
Architecture:arm64
Env:['CFLAGS=-O0', 'DEB_BUILD_PROFILES=noudeb', 'TEST_UPSTREAM=1', 'UPSTREAM_PULL_REQUEST=10857', 'GITHUB_STATUSES_URL=https://api.github.com/repos/systemd/systemd/statuses/af4438e86ddef4ea7b81713a14945d0b110649c2']
Ppas:['pitti/systemd-semaphore']
Build-git:https://salsa.debian.org/systemd-team/systemd.git
Running for:0h 41m 57s

        
Release:bionic
Architecture:arm64
Env:['CFLAGS=-O0', 'DEB_BUILD_PROFILES=noudeb', 'TEST_UPSTREAM=1', 'UPSTREAM_PULL_REQUEST=10857', 'GITHUB_STATUSES_URL=https://api.github.com/repos/systemd/systemd/statuses/06d60f86c4a21a4718c9c9f938012fb5a0a8fd35']
Ppas:['pitti/systemd-semaphore']
Build-git:https://salsa.debian.org/systemd-team/systemd.git
Running for:0h 28m 2s

        
Release:bionic
Architecture:arm64
Env:['CFLAGS=-O0', 'DEB_BUILD_PROFILES=noudeb', 'TEST_UPSTREAM=1', 'UPSTREAM_PULL_REQUEST=10857', 'GITHUB_STATUSES_URL=https://api.github.com/repos/systemd/systemd/statuses/47f10acc2ed147537633940733b93e76d86a43d9']
Ppas:['pitti/systemd-semaphore']
Build-git:https://salsa.debian.org/systemd-team/systemd.git
Running for:0h 23m 32s
[649/1680] cc  -o systemd-socket-activate 'systemd-socket-activate@exe/src_activate_activate.c.o' -flto -Wl,--no-undefined -Wl,--as-needed -Wl,-z,relro -Wl,-z,now -pie -Wl,--gc-sections -g -O2 -fdebug-prefix-map=/tmp/autopkgtest.IIdSFL/build.iyG/systemd=. -fstack-protector-strong -Wformat -Werror=format-security -Wl,-Bsymbolic-functions -Wl,-z,relro -Wl,--start-group src/shared/libsystemd-shared-239.so -Wl,--end-group -pthread '-Wl,-rpath,$ORIGIN/src/shared' -Wl,-rpath-link,/tmp/autopkgtest.IIdSFL/build.iyG/systemd/build-deb/src/shared  

        
Release:bionic
Architecture:i386
Env:['CFLAGS=-O0', 'DEB_BUILD_PROFILES=noudeb', 'TEST_UPSTREAM=1', 'UPSTREAM_PULL_REQUEST=10858', 'GITHUB_STATUSES_URL=https://api.github.com/repos/systemd/systemd/statuses/bd0ce2447d4e8be510e605699f866605274d6c71']
Ppas:['pitti/systemd-semaphore']
Build-git:https://salsa.debian.org/systemd-team/systemd.git
Running for:3h 42m 35s
[DEPEND] Dependency failed for Cryptography Setup for varcrypt.
[DEPEND] Dependency failed for Local Encrypted Volumes.
[DEPEND] Dependency failed for dev-mapper-varcrypt.device.
[DEPEND] Dependency failed for File System Check on /dev/mapper/varcrypt.
[DEPEND] Dependency failed for /var.
[DEPEND] Dependency failed for Update UTMP about System Boot/Shutdown.
[DEPEND] Dependency failed for Update UTMP about System Runlevel Changes.
[DEPEND] Dependency failed for Basic System.
[DEPEND] Dependency failed for Multi-User System.
[DEPEND] Dependency failed for Testsuite target.
[DEPEND] Dependency failed for D-Bus System Message Bus Socket.
[DEPEND] Dependency failed for Login Service.
[DEPEND] Dependency failed for Load/Save Random Seed.
[DEPEND] Dependency failed for Local File Systems.
[DEPEND] Dependency failed for Flush Journal to Persistent Storage.
         Starting Cryptography Setup for varcrypt...
[  OK  ] Reached target Timers.
[  OK  ] Stopped Dispatch Password Requests to Console Directory Watch.
[  OK  ] Stopped Forward Password Requests to Wall Directory Watch.
[  OK  ] Started Emergency Shell.
[  OK  ] Reached target Emergency Mode.
         Starting Commit a transient machine-id on disk...
[  OK  ] Reached target Sockets.
[  OK  ] Reached target Login Prompts.
         Starting Create Volatile Files and Directories...
[  OK  ] Started Commit a transient machine-id on disk.
You are in emergency mode. After logging in, type "journalctl -xb" to view
system logs, "systemctl reboot" to reboot, "systemctl default" or "exit"
to boot into default mode.
Press Enter for maintenance
(or press Control-D to continue): 
        
Release:bionic
Architecture:i386
Env:['CFLAGS=-O0', 'DEB_BUILD_PROFILES=noudeb', 'TEST_UPSTREAM=1', 'UPSTREAM_PULL_REQUEST=10862', 'GITHUB_STATUSES_URL=https://api.github.com/repos/systemd/systemd/statuses/33246ebd14bc2b562487c2534daaf64c48cf6689']
Ppas:['pitti/systemd-semaphore']
Build-git:https://salsa.debian.org/systemd-team/systemd.git
Running for:1h 6m 30s
[1512/1680] /usr/bin/xsltproc -o man/sd_event_source_set_prepare.3 --nonet --xinclude --maxdepth 9000 --stringparam man.output.quietly 1 --stringparam funcsynopsis.style ansi --stringparam man.authors.section.enabled 0 --stringparam man.copyright.section.enabled 0 --stringparam systemd.version 239 --path /tmp/autopkgtest.RcdWTm/build.j9O/systemd/build-deb/man:/tmp/autopkgtest.RcdWTm/build.j9O/systemd/man ../man/custom-man.xsl ../man/sd_event_source_set_prepare.xml
[1513/1680] /usr/bin/xsltproc -o man/sd_event_source_set_priority.3 --nonet --xinclude --maxdepth 9000 --stringparam man.output.quietly 1 --stringparam funcsynopsis.style ansi --stringparam man.authors.section.enabled 0 --stringparam man.copyright.section.enabled 0 --stringparam systemd.version 239 --path /tmp/autopkgtest.RcdWTm/build.j9O/systemd/build-deb/man:/tmp/autopkgtest.RcdWTm/build.j9O/systemd/man ../man/custom-man.xsl ../man/sd_event_source_set_priority.xml
[1514/1680] /usr/bin/xsltproc -o man/sd_event_source_set_userdata.3 --nonet --xinclude --maxdepth 9000 --stringparam man.output.quietly 1 --stringparam funcsynopsis.style ansi --stringparam man.authors.section.enabled 0 --stringparam man.copyright.section.enabled 0 --stringparam systemd.version 239 --path /tmp/autopkgtest.RcdWTm/build.j9O/systemd/build-deb/man:/tmp/autopkgtest.RcdWTm/build.j9O/systemd/man ../man/custom-man.xsl ../man/sd_event_source_set_userdata.xml
[1515/1680] /usr/bin/xsltproc -o man/sd_event_source_unref.3 --nonet --xinclude --maxdepth 9000 --stringparam man.output.quietly 1 --stringparam funcsynopsis.style ansi --stringparam man.authors.section.enabled 0 --stringparam man.copyright.section.enabled 0 --stringparam systemd.version 239 --path /tmp/autopkgtest.RcdWTm/build.j9O/systemd/build-deb/man:/tmp/autopkgtest.RcdWTm/build.j9O/systemd/man ../man/custom-man.xsl ../man/sd_event_source_unref.xml

        
Release:bionic
Architecture:s390x
Env:['CFLAGS=-O0', 'DEB_BUILD_PROFILES=noudeb', 'TEST_UPSTREAM=1', 'UPSTREAM_PULL_REQUEST=10862', 'GITHUB_STATUSES_URL=https://api.github.com/repos/systemd/systemd/statuses/33246ebd14bc2b562487c2534daaf64c48cf6689']
Ppas:['pitti/systemd-semaphore']
Build-git:https://salsa.debian.org/systemd-team/systemd.git
Running for:0h 38m 39s
autopkgtest [19:36:56]: test process requested reboot with marker boot1
Connection to 10.44.46.99 closed by remote host.
test_profile (__main__.AppArmorTest)
AppArmor confined unit ... Replacement succeeded for "violator-test".
ok
test_help (__main__.CLITest)
--help works and succeeds ... ok
test_invalid_option (__main__.CLITest)
Calling with invalid option fails ... ok
test_version (__main__.CLITest)
--version works and succeeds ... ok
test_cpushares (__main__.CgroupsTest)
service with CPUShares ... ok
test_custom_cgroup_cleanup (__main__.CgroupsTest)
cgroup cleanup does not touch manually created cgroups ... skipped 'fix not applied upstream'
test_simple (__main__.CgroupsTest)
simple service ... ok
test_bash_crash (__main__.CoredumpTest) ... ok
test_log_for_service (__main__.JournalTest) ... ok
test_no_options (__main__.JournalTest) ... ok
test_boot (__main__.NspawnTest) ... ok
test_service (__main__.NspawnTest) ... ok
test_failing (__main__.SeccompTest) ... ok
test_0_init (__main__.ServicesTest)
Verify that init is systemd ... ok
test_cron (__main__.ServicesTest) ... ok
test_dbus (__main__.ServicesTest) ... ok
test_gdm3 (__main__.ServicesTest) ... skipped 'gdm3 not found'
test_logind (__main__.ServicesTest) ... ok
test_network_manager (__main__.ServicesTest) ... ok
test_no_failed (__main__.ServicesTest)
No failed units ... ok
test_rsyslog (__main__.ServicesTest) ... skipped 'Forwarding to rsyslog is a Debian patch'
test_tmp_cleanup (__main__.ServicesTest) ... skipped 'Debian specific configuration, N/A for upstream'
test_tmp_mount (__main__.ServicesTest) ... ok
test_udev (__main__.ServicesTest) ... ok

----------------------------------------------------------------------
Ran 24 tests in 9.879s

OK (skipped=4)
autopkgtest [19:37:32]: test boot-and-services: -----------------------]
autopkgtest [19:37:33]: test boot-and-services:  - - - - - - - - - - results - - - - - - - - - -
boot-and-services    PASS
autopkgtest [19:37:33]: test udev: preparing testbed

        
Release:bionic
Architecture:amd64
Env:['CFLAGS=-O0', 'DEB_BUILD_PROFILES=noudeb', 'TEST_UPSTREAM=1', 'UPSTREAM_PULL_REQUEST=10862', 'GITHUB_STATUSES_URL=https://api.github.com/repos/systemd/systemd/statuses/33246ebd14bc2b562487c2534daaf64c48cf6689']
Ppas:['pitti/systemd-semaphore']
Build-git:https://salsa.debian.org/systemd-team/systemd.git
Running for:1h 10m 41s
Preparing to unpack .../08-libisccfg160_1%3a9.11.3+dfsg-1ubuntu1.3_amd64.deb ...
Unpacking libisccfg160:amd64 (1:9.11.3+dfsg-1ubuntu1.3) over (1:9.11.3+dfsg-1ubuntu1.2) ...
Preparing to unpack .../09-libisccc160_1%3a9.11.3+dfsg-1ubuntu1.3_amd64.deb ...
Unpacking libisccc160:amd64 (1:9.11.3+dfsg-1ubuntu1.3) over (1:9.11.3+dfsg-1ubuntu1.2) ...
Preparing to unpack .../10-libdns1100_1%3a9.11.3+dfsg-1ubuntu1.3_amd64.deb ...
Unpacking libdns1100:amd64 (1:9.11.3+dfsg-1ubuntu1.3) over (1:9.11.3+dfsg-1ubuntu1.2) ...
Preparing to unpack .../11-libisc169_1%3a9.11.3+dfsg-1ubuntu1.3_amd64.deb ...
Unpacking libisc169:amd64 (1:9.11.3+dfsg-1ubuntu1.3) over (1:9.11.3+dfsg-1ubuntu1.2) ...
Preparing to unpack .../12-liblwres160_1%3a9.11.3+dfsg-1ubuntu1.3_amd64.deb ...
Unpacking liblwres160:amd64 (1:9.11.3+dfsg-1ubuntu1.3) over (1:9.11.3+dfsg-1ubuntu1.2) ...
Preparing to unpack .../13-python3-gdbm_3.6.7-1~18.04_amd64.deb ...
Unpacking python3-gdbm:amd64 (3.6.7-1~18.04) over (3.6.5-3) ...
Preparing to unpack .../14-python3-update-manager_1%3a18.04.11.7_all.deb ...
Unpacking python3-update-manager (1:18.04.11.7) over (1:18.04.11.6) ...
Preparing to unpack .../15-linux-firmware_1.173.2_all.deb ...
Unpacking linux-firmware (1.173.2) over (1.173.1) ...
Setting up libpython3.6-stdlib:amd64 (3.6.7-1~18.04) ...
Setting up libisc169:amd64 (1:9.11.3+dfsg-1ubuntu1.3) ...
Setting up libnss-systemd:amd64 (237-3ubuntu10.9) ...
Setting up libisccc160:amd64 (1:9.11.3+dfsg-1ubuntu1.3) ...
Setting up python3.6 (3.6.7-1~18.04) ...
Processing triggers for mime-support (3.60ubuntu1) ...
Setting up libisc-export169:amd64 (1:9.11.3+dfsg-1ubuntu1.3) ...
Setting up systemd-sysv (237-3ubuntu10.9) ...
Processing triggers for libc-bin (2.27-3ubuntu1) ...
Setting up udev (237-3ubuntu10.9) ...
update-initramfs: deferring update (trigger activated)
Setting up libdns-export1100 (1:9.11.3+dfsg-1ubuntu1.3) ...
Processing triggers for man-db (2.8.3-2ubuntu0.1) ...

        
Release:bionic
Architecture:i386
Env:['CFLAGS=-O0', 'DEB_BUILD_PROFILES=noudeb', 'TEST_UPSTREAM=1', 'UPSTREAM_PULL_REQUEST=10861', 'GITHUB_STATUSES_URL=https://api.github.com/repos/systemd/systemd/statuses/24572c7e714f50c664ae948b609e04576cb4921d']
Ppas:['pitti/systemd-semaphore']
Build-git:https://salsa.debian.org/systemd-team/systemd.git
Running for:1h 34m 47s
[  OK  ] Reached target Swap.
[  OK  ] Listening on Journal Socket.
         Starting File System Check on Root Device...
         Mounting Huge Pages File System...
         Mounting POSIX Message Queue File System...
[  OK  ] Listening on Journal Audit Socket.
[  OK  ] Listening on udev Kernel Socket.
         Starting udev Coldplug all Devices...
[UNSUPP] Starting of Arbitrary Executable Fi…tem Automount Point not supported.
         Starting Load Kernel Modules...
         Mounting Kernel Debug File System...
[  OK  ] Created slice User and Session Slice.
[  OK  ] Reached target Slices.
[  OK  ] Started Dispatch Password Requests to Console Directory Watch.
[  OK  ] Reached target Local Encrypted Volumes.
[  OK  ] Reached target Paths.
[  OK  ] Listening on Journal Socket (/dev/log).
         Starting Journal Service...
[  OK  ] Started File System Check on Root Device.
[  OK  ] Mounted Huge Pages File System.
[  OK  ] Mounted POSIX Message Queue File System.
[  OK  ] Started Load Kernel Modules.
[  OK  ] Mounted Kernel Debug File System.
         Mounting FUSE Control File System...
         Mounting Kernel Configuration File System...
         Starting Apply Kernel Variables...
         Starting Remount Root and Kernel File Systems...
[  OK  ] Mounted FUSE Control File System.
[  OK  ] Mounted Kernel Configuration File System.
[  OK  ] Started Apply Kernel Variables.
[  OK  ] Started Remount Root and Kernel File Systems.
         Starting Load/Save Random Seed...
         Starting Create System Users...
[  OK  ] Started Load/Save Random Seed.
[  OK  ] Started Create System Users.
         Starting Create Static Device Nodes in /dev...

        
Release:bionic
Architecture:s390x
Env:['CFLAGS=-O0', 'DEB_BUILD_PROFILES=noudeb', 'TEST_UPSTREAM=1', 'UPSTREAM_PULL_REQUEST=10861', 'GITHUB_STATUSES_URL=https://api.github.com/repos/systemd/systemd/statuses/24572c7e714f50c664ae948b609e04576cb4921d']
Ppas:['pitti/systemd-semaphore']
Build-git:https://salsa.debian.org/systemd-team/systemd.git
Running for:1h 19m 31s
autopkgtest [19:36:24]: test boot-smoke: [-----------------------
reboot #0
bash: line 1:  7778 Killed                  /tmp/autopkgtest.MMDKiF/build.2Nv/systemd/debian/tests/boot-smoke 2> >(tee -a /tmp/autopkgtest.MMDKiF/boot-smoke-stderr >&2) > >(tee -a /tmp/autopkgtest.MMDKiF/boot-smoke-stdout)
autopkgtest [19:36:24]: test process requested reboot with marker 1
Connection to 10.44.46.93 closed by remote host.
checking for failed unmounts for user systemd
checking for connection timeouts
checking that polkitd runs
375
checking that there are no running jobs
reboot #1
bash: line 1:   527 Killed                  /tmp/autopkgtest.MMDKiF/build.2Nv/systemd/debian/tests/boot-smoke 2> >(tee -a /tmp/autopkgtest.MMDKiF/boot-smoke-stderr >&2) > >(tee -a /tmp/autopkgtest.MMDKiF/boot-smoke-stdout)
autopkgtest [19:36:49]: test process requested reboot with marker 2
Connection to 10.44.46.93 closed by remote host.
checking for failed unmounts for user systemd
checking for connection timeouts
checking that polkitd runs
375
checking that there are no running jobs
reboot #2
bash: line 1:   527 Killed                  /tmp/autopkgtest.MMDKiF/build.2Nv/systemd/debian/tests/boot-smoke 2> >(tee -a /tmp/autopkgtest.MMDKiF/boot-smoke-stderr >&2) > >(tee -a /tmp/autopkgtest.MMDKiF/boot-smoke-stdout)
autopkgtest [19:37:09]: test process requested reboot with marker 3
Connection to 10.44.46.93 closed by remote host.
checking for failed unmounts for user systemd
checking for connection timeouts
checking that polkitd runs
375
checking that there are no running jobs
reboot #3
bash: line 1:   528 Killed                  /tmp/autopkgtest.MMDKiF/build.2Nv/systemd/debian/tests/boot-smoke 2> >(tee -a /tmp/autopkgtest.MMDKiF/boot-smoke-stderr >&2) > >(tee -a /tmp/autopkgtest.MMDKiF/boot-smoke-stdout)
autopkgtest [19:37:30]: test process requested reboot with marker 4
Connection to 10.44.46.93 closed by remote host.
checking for failed unmounts for user systemd
checking for connection timeouts
bash: line 1:   527 Killed                  /tmp/autopkgtest.MMDKiF/build.2Nv/systemd/debian/tests/boot-smoke 2> >(tee -a /tmp/autopkgtest.MMDKiF/boot-smoke-stderr >&2) > >(tee -a /tmp/autopkgtest.MMDKiF/boot-smoke-stdout)
checking that polkitd runs
377
checking that there are no running jobs
reboot #4
autopkgtest [19:37:50]: test process requested reboot with marker 5

        
Release:bionic
Architecture:amd64
Env:['CFLAGS=-O0', 'DEB_BUILD_PROFILES=noudeb', 'TEST_UPSTREAM=1', 'UPSTREAM_PULL_REQUEST=10861', 'GITHUB_STATUSES_URL=https://api.github.com/repos/systemd/systemd/statuses/24572c7e714f50c664ae948b609e04576cb4921d']
Ppas:['pitti/systemd-semaphore']
Build-git:https://salsa.debian.org/systemd-team/systemd.git
Running for:1h 34m 51s
Preparing to unpack .../binaries/./systemd-sysv.deb ...
Unpacking systemd-sysv (239-2557-g24572c7e7-0) over (239-2557-g24572c7e7-0) ...
Preparing to unpack .../binaries/./libudev1.deb ...
Unpacking libudev1:amd64 (239-2557-g24572c7e7-0) over (239-2557-g24572c7e7-0) ...
Setting up libudev1:amd64 (239-2557-g24572c7e7-0) ...
(Reading database ... 
(Reading database ... 5%
(Reading database ... 10%
(Reading database ... 15%
(Reading database ... 20%
(Reading database ... 25%
(Reading database ... 30%
(Reading database ... 35%
(Reading database ... 40%
(Reading database ... 45%
(Reading database ... 50%
(Reading database ... 55%
(Reading database ... 60%
(Reading database ... 65%
(Reading database ... 70%
(Reading database ... 75%
(Reading database ... 80%
(Reading database ... 85%
(Reading database ... 90%
(Reading database ... 95%
(Reading database ... 100%
(Reading database ... 62429 files and directories currently installed.)
Preparing to unpack .../binaries/./libpam-systemd.deb ...
Unpacking libpam-systemd:amd64 (239-2557-g24572c7e7-0) over (239-2557-g24572c7e7-0) ...
Preparing to unpack .../binaries/./libnss-systemd.deb ...
Unpacking libnss-systemd:amd64 (239-2557-g24572c7e7-0) over (239-2557-g24572c7e7-0) ...
Setting up libnss-systemd:amd64 (239-2557-g24572c7e7-0) ...
Setting up systemd-sysv (239-2557-g24572c7e7-0) ...
Processing triggers for libc-bin (2.27-3ubuntu1) ...
Setting up udev (239-2557-g24572c7e7-0) ...
update-initramfs: deferring update (trigger activated)
Processing triggers for man-db (2.8.3-2ubuntu0.1) ...
Processing triggers for dbus (1.12.2-1ubuntu1) ...
Setting up libpam-systemd:amd64 (239-2557-g24572c7e7-0) ...
Processing triggers for initramfs-tools (0.130ubuntu3.5) ...
update-initramfs: Generating /boot/initrd.img-4.15.0-39-generic

        
Release:bionic
Architecture:arm64
Env:['CFLAGS=-O0', 'DEB_BUILD_PROFILES=noudeb', 'TEST_UPSTREAM=1', 'UPSTREAM_PULL_REQUEST=10797', 'GITHUB_STATUSES_URL=https://api.github.com/repos/systemd/systemd/statuses/86a847b6cde1ea6a069c6fac51220766deade4a8']
Ppas:['pitti/systemd-semaphore']
Build-git:https://salsa.debian.org/systemd-team/systemd.git
Running for:7h 33m 28s
dpkg-gencontrol: warning: Depends field of package libudev-dev: unknown substitution variable ${shlibs:Depends}
   dh_md5sums -O--buildsystem=meson
   dh_builddeb -O--buildsystem=meson
dpkg-deb: building package 'systemd' in '../systemd_239-2561-g6fda261d9-0_arm64.deb'.
dpkg-deb: building package 'systemd-dbgsym' in 'debian/.debhelper/scratch-space/build-systemd/systemd-dbgsym_239-2561-g6fda261d9-0_arm64.deb'.
	Renaming systemd-dbgsym_239-2561-g6fda261d9-0_arm64.deb to systemd-dbgsym_239-2561-g6fda261d9-0_arm64.ddeb
dpkg-deb: building package 'systemd-sysv' in '../systemd-sysv_239-2561-g6fda261d9-0_arm64.deb'.
dpkg-deb: building package 'systemd-container' in '../systemd-container_239-2561-g6fda261d9-0_arm64.deb'.
dpkg-deb: building package 'systemd-container-dbgsym' in 'debian/.debhelper/scratch-space/build-systemd-container/systemd-container-dbgsym_239-2561-g6fda261d9-0_arm64.deb'.
	Renaming systemd-container-dbgsym_239-2561-g6fda261d9-0_arm64.deb to systemd-container-dbgsym_239-2561-g6fda261d9-0_arm64.ddeb
dpkg-deb: building package 'systemd-journal-remote' in '../systemd-journal-remote_239-2561-g6fda261d9-0_arm64.deb'.
dpkg-deb: building package 'systemd-journal-remote-dbgsym' in 'debian/.debhelper/scratch-space/build-systemd-journal-remote/systemd-journal-remote-dbgsym_239-2561-g6fda261d9-0_arm64.deb'.
	Renaming systemd-journal-remote-dbgsym_239-2561-g6fda261d9-0_arm64.deb to systemd-journal-remote-dbgsym_239-2561-g6fda261d9-0_arm64.ddeb
dpkg-deb: building package 'systemd-coredump' in '../systemd-coredump_239-2561-g6fda261d9-0_arm64.deb'.
dpkg-deb: building package 'systemd-coredump-dbgsym' in 'debian/.debhelper/scratch-space/build-systemd-coredump/systemd-coredump-dbgsym_239-2561-g6fda261d9-0_arm64.deb'.
	Renaming systemd-coredump-dbgsym_239-2561-g6fda261d9-0_arm64.deb to systemd-coredump-dbgsym_239-2561-g6fda261d9-0_arm64.ddeb
dpkg-deb: building package 'systemd-tests' in '../systemd-tests_239-2561-g6fda261d9-0_arm64.deb'.

        
Release:bionic
Architecture:arm64
Env:['CFLAGS=-O0', 'DEB_BUILD_PROFILES=noudeb', 'TEST_UPSTREAM=1', 'UPSTREAM_PULL_REQUEST=10850', 'GITHUB_STATUSES_URL=https://api.github.com/repos/systemd/systemd/statuses/6bf3c61c57f1ba439b2124fb89229395a77f8f46']
Ppas:['pitti/systemd-semaphore']
Build-git:https://salsa.debian.org/systemd-team/systemd.git
Running for:6h 28m 57s
dpkg-deb: building package 'libnss-systemd' in '../libnss-systemd_239-2556-g7fa0269bc-0_arm64.deb'.
dpkg-deb: building package 'libnss-systemd-dbgsym' in 'debian/.debhelper/scratch-space/build-libnss-systemd/libnss-systemd-dbgsym_239-2556-g7fa0269bc-0_arm64.deb'.
	Renaming libnss-systemd-dbgsym_239-2556-g7fa0269bc-0_arm64.deb to libnss-systemd-dbgsym_239-2556-g7fa0269bc-0_arm64.ddeb
dpkg-deb: building package 'libsystemd0' in '../libsystemd0_239-2556-g7fa0269bc-0_arm64.deb'.
dpkg-deb: building package 'libsystemd0-dbgsym' in 'debian/.debhelper/scratch-space/build-libsystemd0/libsystemd0-dbgsym_239-2556-g7fa0269bc-0_arm64.deb'.
	Renaming libsystemd0-dbgsym_239-2556-g7fa0269bc-0_arm64.deb to libsystemd0-dbgsym_239-2556-g7fa0269bc-0_arm64.ddeb
dpkg-deb: building package 'libsystemd-dev' in '../libsystemd-dev_239-2556-g7fa0269bc-0_arm64.deb'.
dpkg-deb: building package 'udev' in '../udev_239-2556-g7fa0269bc-0_arm64.deb'.
dpkg-deb: building package 'udev-dbgsym' in 'debian/.debhelper/scratch-space/build-udev/udev-dbgsym_239-2556-g7fa0269bc-0_arm64.deb'.
	Renaming udev-dbgsym_239-2556-g7fa0269bc-0_arm64.deb to udev-dbgsym_239-2556-g7fa0269bc-0_arm64.ddeb
dpkg-deb: building package 'libudev1' in '../libudev1_239-2556-g7fa0269bc-0_arm64.deb'.
dpkg-deb: building package 'libudev1-dbgsym' in 'debian/.debhelper/scratch-space/build-libudev1/libudev1-dbgsym_239-2556-g7fa0269bc-0_arm64.deb'.
	Renaming libudev1-dbgsym_239-2556-g7fa0269bc-0_arm64.deb to libudev1-dbgsym_239-2556-g7fa0269bc-0_arm64.ddeb
dpkg-deb: building package 'libudev-dev' in '../libudev-dev_239-2556-g7fa0269bc-0_arm64.deb'.
 dpkg-genbuildinfo --build=binary
 dpkg-genchanges --build=binary >../systemd_239-12_arm64.changes
dpkg-genchanges: info: binary-only upload (no source code included)
 dpkg-source --after-build systemd
dpkg-buildpackage: info: binary-only upload (no source included)
autopkgtest [19:37:55]: test timedated: preparing testbed

        
Release:bionic
Architecture:i386
Env:['CFLAGS=-O0', 'DEB_BUILD_PROFILES=noudeb', 'TEST_UPSTREAM=1', 'UPSTREAM_PULL_REQUEST=10857', 'GITHUB_STATUSES_URL=https://api.github.com/repos/systemd/systemd/statuses/93de583ad68b4ee9311cff16f5b9bb4f190095e2']
Ppas:['pitti/systemd-semaphore']
Build-git:https://salsa.debian.org/systemd-team/systemd.git
Running for:0h 51m 15s
[1568/1680] /usr/bin/xsltproc -o man/systemd-delta.1 --nonet --xinclude --maxdepth 9000 --stringparam man.output.quietly 1 --stringparam funcsynopsis.style ansi --stringparam man.authors.section.enabled 0 --stringparam man.copyright.section.enabled 0 --stringparam systemd.version 239 --path /tmp/autopkgtest.D5Qz4a/build.Kyn/systemd/build-deb/man:/tmp/autopkgtest.D5Qz4a/build.Kyn/systemd/man ../man/custom-man.xsl ../man/systemd-delta.xml
[1569/1680] /usr/bin/xsltproc -o man/systemd-detect-virt.1 --nonet --xinclude --maxdepth 9000 --stringparam man.output.quietly 1 --stringparam funcsynopsis.style ansi --stringparam man.authors.section.enabled 0 --stringparam man.copyright.section.enabled 0 --stringparam systemd.version 239 --path /tmp/autopkgtest.D5Qz4a/build.Kyn/systemd/build-deb/man:/tmp/autopkgtest.D5Qz4a/build.Kyn/systemd/man ../man/custom-man.xsl ../man/systemd-detect-virt.xml
[1570/1680] /usr/bin/xsltproc -o man/systemd-environment-d-generator.8 --nonet --xinclude --maxdepth 9000 --stringparam man.output.quietly 1 --stringparam funcsynopsis.style ansi --stringparam man.authors.section.enabled 0 --stringparam man.copyright.section.enabled 0 --stringparam systemd.version 239 --path /tmp/autopkgtest.D5Qz4a/build.Kyn/systemd/build-deb/man:/tmp/autopkgtest.D5Qz4a/build.Kyn/systemd/man ../man/custom-man.xsl ../man/systemd-environment-d-generator.xml
[1571/1680] /usr/bin/xsltproc -o man/systemd-escape.1 --nonet --xinclude --maxdepth 9000 --stringparam man.output.quietly 1 --stringparam funcsynopsis.style ansi --stringparam man.authors.section.enabled 0 --stringparam man.copyright.section.enabled 0 --stringparam systemd.version 239 --path /tmp/autopkgtest.D5Qz4a/build.Kyn/systemd/build-deb/man:/tmp/autopkgtest.D5Qz4a/build.Kyn/systemd/man ../man/custom-man.xsl ../man/systemd-escape.xml

        
Release:bionic
Architecture:amd64
Env:['CFLAGS=-O0', 'DEB_BUILD_PROFILES=noudeb', 'TEST_UPSTREAM=1', 'UPSTREAM_PULL_REQUEST=10857', 'GITHUB_STATUSES_URL=https://api.github.com/repos/systemd/systemd/statuses/93de583ad68b4ee9311cff16f5b9bb4f190095e2']
Ppas:['pitti/systemd-semaphore']
Build-git:https://salsa.debian.org/systemd-team/systemd.git
Running for:3h 36m 6s
7:hugetlb:/
6:freezer:/
5:memory:/
4:pids:/
3:perf_event:/
2:devices:/
1:name=systemd:/
0::/

/proc/1/uid_map:
         0 1691090944      65536

/proc/1/setgroups:
allow

/proc/1/gid_map:
         0 1691090944      65536

ip link:
1: lo: <LOOPBACK,UP,LOWER_UP> mtu 65536 qdisc noqueue qlen 1000
    link/loopback 00:00:00:00:00:00 brd 00:00:00:00:00:00

Sent message type=method_call sender=n/a destination=org.freedesktop.systemd1 path=/org/freedesktop/systemd1 interface=org.freedesktop.systemd1.Manager member=AbandonScope cookie=6 reply_cookie=0 signature=s error-name=n/a error-message=n/a
Got message type=error sender=:1.1 destination=:1.48 path=n/a interface=n/a member=n/a cookie=953 reply_cookie=6 signature=s error-name=org.freedesktop.systemd1.ScopeNotRunning error-message=Scope unified-no-cgns-yes-api-vfs-writable-no.scope is not running, cannot abandon.
Failed to abandon scope 'unified-no-cgns-yes-api-vfs-writable-no.scope', ignoring: Scope unified-no-cgns-yes-api-vfs-writable-no.scope is not running, cannot abandon.
Sent message type=method_call sender=n/a destination=org.freedesktop.systemd1 path=/org/freedesktop/systemd1 interface=org.freedesktop.systemd1.Manager member=KillUnit cookie=7 reply_cookie=0 signature=ssi error-name=n/a error-message=n/a
Got message type=method_return sender=:1.1 destination=:1.48 path=n/a interface=n/a member=n/a cookie=955 reply_cookie=7 signature=n/a error-name=n/a error-message=n/a
Sent message type=method_call sender=n/a destination=org.freedesktop.systemd1 path=/org/freedesktop/systemd1 interface=org.freedesktop.systemd1.Manager member=UnrefUnit cookie=8 reply_cookie=0 signature=s error-name=n/a error-message=n/a
Got message type=method_return sender=:1.1 destination=:1.48 path=n/a interface=n/a member=n/a cookie=957 reply_cookie=8 signature=n/a error-name=n/a error-message=n/a
Container unified-no-cgns-yes-api-vfs-writable-no exited successfully.
Bus n/a: changing state RUNNING → CLOSED

        
Release:bionic
Architecture:i386
Env:['CFLAGS=-O0', 'DEB_BUILD_PROFILES=noudeb', 'TEST_UPSTREAM=1', 'UPSTREAM_PULL_REQUEST=10860', 'GITHUB_STATUSES_URL=https://api.github.com/repos/systemd/systemd/statuses/806cc8d62d34ed852bfa187a0a10a09befff38d3']
Ppas:['pitti/systemd-semaphore']
Build-git:https://salsa.debian.org/systemd-team/systemd.git
Running for:3h 19m 47s

Creating config file /etc/gdm3/greeter.dconf-defaults with new version
gdm.service is not active, cannot reload.
invoke-rc.d: initscript gdm3, action "reload" failed.
Setting up autopkgtest-satdep (0) ...
Processing triggers for libc-bin (2.27-3ubuntu1) ...
Processing triggers for systemd (239-2599-g806cc8d62-0) ...
Processing triggers for dictionaries-common (1.27.2) ...
aspell-autobuildhash: processing: en [en-common].
aspell-autobuildhash: processing: en [en-variant_0].
aspell-autobuildhash: processing: en [en-variant_1].
aspell-autobuildhash: processing: en [en-variant_2].
aspell-autobuildhash: processing: en [en-w_accents-only].
aspell-autobuildhash: processing: en [en-wo_accents-only].
aspell-autobuildhash: processing: en [en_AU-variant_0].
aspell-autobuildhash: processing: en [en_AU-variant_1].
aspell-autobuildhash: processing: en [en_AU-w_accents-only].
aspell-autobuildhash: processing: en [en_AU-wo_accents-only].
aspell-autobuildhash: processing: en [en_CA-variant_0].
aspell-autobuildhash: processing: en [en_CA-variant_1].
aspell-autobuildhash: processing: en [en_CA-w_accents-only].
aspell-autobuildhash: processing: en [en_CA-wo_accents-only].
aspell-autobuildhash: processing: en [en_GB-ise-w_accents-only].
aspell-autobuildhash: processing: en [en_GB-ise-wo_accents-only].
aspell-autobuildhash: processing: en [en_GB-ize-w_accents-only].
aspell-autobuildhash: processing: en [en_GB-ize-wo_accents-only].
aspell-autobuildhash: processing: en [en_GB-variant_0].
aspell-autobuildhash: processing: en [en_GB-variant_1].
aspell-autobuildhash: processing: en [en_US-w_accents-only].
aspell-autobuildhash: processing: en [en_US-wo_accents-only].
Processing triggers for dbus (1.12.2-1ubuntu1) ...
Processing triggers for libgdk-pixbuf2.0-0:i386 (2.36.11-2) ...
(Reading database ... 82627 files and directories currently installed.)
Removing autopkgtest-satdep (0) ...

        
Release:bionic
Architecture:i386
Env:['CFLAGS=-O0', 'DEB_BUILD_PROFILES=noudeb', 'TEST_UPSTREAM=1', 'UPSTREAM_PULL_REQUEST=10797', 'GITHUB_STATUSES_URL=https://api.github.com/repos/systemd/systemd/statuses/6fda261d9fed6b49a780e9a9dbdb61ec782496be']
Ppas:['pitti/systemd-semaphore']
Build-git:https://salsa.debian.org/systemd-team/systemd.git
Running for:3h 17m 56s
Remounting /sys/fs/cgroup/pids (MS_RDONLY|MS_NOSUID|MS_NODEV|MS_NOEXEC|MS_REMOUNT|MS_BIND "")...
Mounting cgroup on /sys/fs/cgroup/rdma (MS_NOSUID|MS_NODEV|MS_NOEXEC "rdma")...
Remounting /sys/fs/cgroup/rdma (MS_RDONLY|MS_NOSUID|MS_NODEV|MS_NOEXEC|MS_REMOUNT|MS_BIND "")...
Mounting cgroup on /sys/fs/cgroup/memory (MS_NOSUID|MS_NODEV|MS_NOEXEC "memory")...
Remounting /sys/fs/cgroup/memory (MS_RDONLY|MS_NOSUID|MS_NODEV|MS_NOEXEC|MS_REMOUNT|MS_BIND "")...
Mounting cgroup on /sys/fs/cgroup/cpu,cpuacct (MS_NOSUID|MS_NODEV|MS_NOEXEC "cpu,cpuacct")...
Remounting /sys/fs/cgroup/cpu,cpuacct (MS_RDONLY|MS_NOSUID|MS_NODEV|MS_NOEXEC|MS_REMOUNT|MS_BIND "")...
Mounting cgroup on /sys/fs/cgroup/net_cls,net_prio (MS_NOSUID|MS_NODEV|MS_NOEXEC "net_cls,net_prio")...
Remounting /sys/fs/cgroup/net_cls,net_prio (MS_RDONLY|MS_NOSUID|MS_NODEV|MS_NOEXEC|MS_REMOUNT|MS_BIND "")...
Mounting cgroup on /sys/fs/cgroup/systemd (MS_NOSUID|MS_NODEV|MS_NOEXEC "none,name=systemd,xattr")...
Remounting /sys/fs/cgroup (MS_RDONLY|MS_NOSUID|MS_NODEV|MS_NOEXEC|MS_REMOUNT|MS_STRICTATIME "mode=755")...
Bind-mounting /tmp/.#proc-sys-kernel-random-boot-id2afa43ad6d84f347 on /proc/sys/kernel/random/boot_id (MS_BIND "")...
Remounting /proc/sys/kernel/random/boot_id (MS_RDONLY|MS_NOSUID|MS_NODEV|MS_NOEXEC|MS_REMOUNT|MS_BIND "")...
Bind-mounting /tmp/.#proc-kmsg2d083266bc3fe0cd on /proc/kmsg (MS_BIND "")...
+ + echobusybox a
 which nc
+ /bin/nc -U -u -w 1 /run/systemd/nspawn/notify
Received notify message without valid credentials. Ignoring.

Sent message type=method_call sender=n/a destination=org.freedesktop.systemd1 path=/org/freedesktop/systemd1 interface=org.freedesktop.systemd1.Manager member=AbandonScope cookie=6 reply_cookie=0 signature=s error-name=n/a error-message=n/a
Got message type=error sender=:1.0 destination=:1.5 path=n/a interface=n/a member=n/a cookie=74 reply_cookie=6 signature=s error-name=org.freedesktop.systemd1.
        
Release:bionic
Architecture:amd64
Env:['CFLAGS=-O0', 'DEB_BUILD_PROFILES=noudeb', 'TEST_UPSTREAM=1', 'UPSTREAM_PULL_REQUEST=10797', 'GITHUB_STATUSES_URL=https://api.github.com/repos/systemd/systemd/statuses/6fda261d9fed6b49a780e9a9dbdb61ec782496be']
Ppas:['pitti/systemd-semaphore']
Build-git:https://salsa.debian.org/systemd-team/systemd.git
Running for:3h 10m 3s
systemd-machine-id-commit.service: Job 31 systemd-machine-id-commit.service/start finished, result=done
Operating on architecture: x32
Operating on architecture: x86-64
systemd-journald.service: Got notification message from PID 15 (READY=1, STATUS=Processing requests...)
systemd-journald.service: Changed start -> running
systemd-journald.service: Job 14 systemd-journald.service/start finished, result=done
[  OK  ] Started Journal Service.
         Starting Flush Journal to Persistent Storage...
[  OK  ] Started Flush Journal to Persistent Storage.
         Starting Create Volatile Files and Directories...
[  OK  ] Started Create Volatile Files and Directories.
         Starting Update UTMP about System Boot/Shutdown...
[  OK  ] Started Update UTMP about System Boot/Shutdown.
[  OK  ] Started Rebuild Hardware Database.
[  OK  ] Reached target System Initialization.
[  OK  ] Started Daily Cleanup of Temporary Directories.
[  OK  ] Reached target Timers.
[  OK  ] Listening on D-Bus System Message Bus Socket.
[  OK  ] Reached target Sockets.
[  OK  ] Reached target Basic System.
         Starting /etc/rc.local Compatibility...
         Starting Permit User Sessions...
rc.local[24]: /etc/rc.local: 2: /etc/rc.local: iptables: not found
         Starting Login Service...
         Starting Testsuite service...
[  OK  ] Started /etc/rc.local Compatibility.
[  OK  ] Started Permit User Sessions.
[  OK  ] Started Console Getty.
[  OK  ] Reached target Login Prompts.
[  OK  ] Started D-Bus System Message Bus.
[  OK  ] Started Login Service.
[  OK  ] Reached target Multi-User System.
         Starting Update UTMP about System Runlevel Changes...
[  OK  ] Started Update UTMP about System Runlevel Changes.


systemd-testsuite login: 
        
Release:bionic
Architecture:i386
Env:['CFLAGS=-O0', 'DEB_BUILD_PROFILES=noudeb', 'TEST_UPSTREAM=1', 'UPSTREAM_PULL_REQUEST=10857', 'GITHUB_STATUSES_URL=https://api.github.com/repos/systemd/systemd/statuses/7ec726ace63a19f1ee460a1ef651444a1554c49d']
Ppas:['pitti/systemd-semaphore']
Build-git:https://salsa.debian.org/systemd-team/systemd.git
Running for:2h 51m 53s

Creating config file /etc/gdm3/greeter.dconf-defaults with new version
gdm.service is not active, cannot reload.
invoke-rc.d: initscript gdm3, action "reload" failed.
Setting up autopkgtest-satdep (0) ...
Processing triggers for libc-bin (2.27-3ubuntu1) ...
Processing triggers for systemd (239-2557-g7ec726ace-0) ...
Processing triggers for dictionaries-common (1.27.2) ...
aspell-autobuildhash: processing: en [en-common].
aspell-autobuildhash: processing: en [en-variant_0].
aspell-autobuildhash: processing: en [en-variant_1].
aspell-autobuildhash: processing: en [en-variant_2].
aspell-autobuildhash: processing: en [en-w_accents-only].
aspell-autobuildhash: processing: en [en-wo_accents-only].
aspell-autobuildhash: processing: en [en_AU-variant_0].
aspell-autobuildhash: processing: en [en_AU-variant_1].
aspell-autobuildhash: processing: en [en_AU-w_accents-only].
aspell-autobuildhash: processing: en [en_AU-wo_accents-only].
aspell-autobuildhash: processing: en [en_CA-variant_0].
aspell-autobuildhash: processing: en [en_CA-variant_1].
aspell-autobuildhash: processing: en [en_CA-w_accents-only].
aspell-autobuildhash: processing: en [en_CA-wo_accents-only].
aspell-autobuildhash: processing: en [en_GB-ise-w_accents-only].
aspell-autobuildhash: processing: en [en_GB-ise-wo_accents-only].
aspell-autobuildhash: processing: en [en_GB-ize-w_accents-only].
aspell-autobuildhash: processing: en [en_GB-ize-wo_accents-only].
aspell-autobuildhash: processing: en [en_GB-variant_0].
aspell-autobuildhash: processing: en [en_GB-variant_1].
aspell-autobuildhash: processing: en [en_US-w_accents-only].
aspell-autobuildhash: processing: en [en_US-wo_accents-only].
Processing triggers for dbus (1.12.2-1ubuntu1) ...
Processing triggers for libgdk-pixbuf2.0-0:i386 (2.36.11-2) ...
(Reading database ... 82627 files and directories currently installed.)
Removing autopkgtest-satdep (0) ...

        
Release:bionic
Architecture:arm64
Env:['CFLAGS=-O0', 'DEB_BUILD_PROFILES=noudeb', 'TEST_UPSTREAM=1', 'UPSTREAM_PULL_REQUEST=10856', 'GITHUB_STATUSES_URL=https://api.github.com/repos/systemd/systemd/statuses/8716b428396acb6e936d3b815bbf8cc251d872de']
Ppas:['pitti/systemd-semaphore']
Build-git:https://salsa.debian.org/systemd-team/systemd.git
Running for:1h 41m 20s
Unpacking python3-update-manager (1:18.04.11.7) over (1:18.04.11.6) ...
Preparing to unpack .../15-linux-firmware_1.173.2_all.deb ...
Unpacking linux-firmware (1.173.2) over (1.173.1) ...
Setting up libpython3.6-stdlib:arm64 (3.6.7-1~18.04) ...
Setting up libisc169:arm64 (1:9.11.3+dfsg-1ubuntu1.3) ...
Setting up libnss-systemd:arm64 (237-3ubuntu10.9) ...
Setting up libisccc160:arm64 (1:9.11.3+dfsg-1ubuntu1.3) ...
Setting up python3.6 (3.6.7-1~18.04) ...
Processing triggers for mime-support (3.60ubuntu1) ...
Setting up libisc-export169:arm64 (1:9.11.3+dfsg-1ubuntu1.3) ...
Setting up systemd-sysv (237-3ubuntu10.9) ...
Processing triggers for libc-bin (2.27-3ubuntu1) ...
Setting up udev (237-3ubuntu10.9) ...
update-initramfs: deferring update (trigger activated)
Setting up libdns-export1100 (1:9.11.3+dfsg-1ubuntu1.3) ...
Processing triggers for man-db (2.8.3-2ubuntu0.1) ...
Processing triggers for dbus (1.12.2-1ubuntu1) ...
Setting up libdns1100:arm64 (1:9.11.3+dfsg-1ubuntu1.3) ...
Setting up linux-firmware (1.173.2) ...
update-initramfs: Generating /boot/initrd.img-4.15.0-39-generic
flash-kernel: deferring update (trigger activated)
Setting up liblwres160:arm64 (1:9.11.3+dfsg-1ubuntu1.3) ...
Setting up libpython3.6:arm64 (3.6.7-1~18.04) ...
Setting up libpython3-stdlib:arm64 (3.6.7-1~18.04) ...
Setting up libpam-systemd:arm64 (237-3ubuntu10.9) ...
Setting up python3 (3.6.7-1~18.04) ...
Setting up python3-update-manager (1:18.04.11.7) ...
Setting up libisccfg160:arm64 (1:9.11.3+dfsg-1ubuntu1.3) ...
Setting up python3-gdbm:arm64 (3.6.7-1~18.04) ...
Setting up libirs160:arm64 (1:9.11.3+dfsg-1ubuntu1.3) ...
Setting up libbind9-160:arm64 (1:9.11.3+dfsg-1ubuntu1.3) ...
Setting up bind9-host (1:9.11.3+dfsg-1ubuntu1.3) ...
Setting up dnsutils (1:9.11.3+dfsg-1ubuntu1.3) ...
Processing triggers for initramfs-tools (0.130ubuntu3.5) ...
update-initramfs: Generating /boot/initrd.img-4.15.0-39-generic

        
Release:bionic
Architecture:i386
Env:['CFLAGS=-O0', 'DEB_BUILD_PROFILES=noudeb', 'TEST_UPSTREAM=1', 'UPSTREAM_PULL_REQUEST=10860', 'GITHUB_STATUSES_URL=https://api.github.com/repos/systemd/systemd/statuses/2e34ce14a17478883fa29c7e330ad0828db72e97']
Ppas:['pitti/systemd-semaphore']
Build-git:https://salsa.debian.org/systemd-team/systemd.git
Running for:1h 56m 53s
[DEPEND] Dependency failed for Cryptography Setup for varcrypt.
[DEPEND] Dependency failed for Local Encrypted Volumes.
[DEPEND] Dependency failed for dev-mapper-varcrypt.device.
[DEPEND] Dependency failed for File System Check on /dev/mapper/varcrypt.
[DEPEND] Dependency failed for /var.
[DEPEND] Dependency failed for D-Bus System Message Bus Socket.
[DEPEND] Dependency failed for Login Service.
[DEPEND] Dependency failed for Update UTMP about System Boot/Shutdown.
[DEPEND] Dependency failed for Update UTMP about System Runlevel Changes.
[DEPEND] Dependency failed for Flush Journal to Persistent Storage.
[DEPEND] Dependency failed for Basic System.
[DEPEND] Dependency failed for Multi-User System.
[DEPEND] Dependency failed for Testsuite target.
[DEPEND] Dependency failed for Load/Save Random Seed.
[DEPEND] Dependency failed for Local File Systems.
[  OK  ] Reached target Timers.
[  OK  ] Stopped Forward Password Requests to Wall Directory Watch.
[  OK  ] Stopped Dispatch Password Requests to Console Directory Watch.
[  OK  ] Started Emergency Shell.
         Starting Commit a transient machine-id on disk...
[  OK  ] Reached target Emergency Mode.
[  OK  ] Reached target Login Prompts.
         Starting Create Volatile Files and Directories...
[  OK  ] Reached target Sockets.
[  OK  ] Started Commit a transient machine-id on disk.
[  OK  ] Started Create Volatile Files and Directories.
You are in emergency mode. After logging in, type "journalctl -xb" to view
system logs, "systemctl reboot" to reboot, "systemctl default" or "exit"
to boot into default mode.
Press Enter for maintenance
(or press Control-D to continue): 
        
Release:bionic
Architecture:amd64
Env:['CFLAGS=-O0', 'DEB_BUILD_PROFILES=noudeb', 'TEST_UPSTREAM=1', 'UPSTREAM_PULL_REQUEST=10860', 'GITHUB_STATUSES_URL=https://api.github.com/repos/systemd/systemd/statuses/2e34ce14a17478883fa29c7e330ad0828db72e97']
Ppas:['pitti/systemd-semaphore']
Build-git:https://salsa.debian.org/systemd-team/systemd.git
Running for:1h 56m 54s
aspell-autobuildhash: processing: en [en-wo_accents-only].
aspell-autobuildhash: processing: en [en_AU-variant_0].
aspell-autobuildhash: processing: en [en_AU-variant_1].
aspell-autobuildhash: processing: en [en_AU-w_accents-only].
aspell-autobuildhash: processing: en [en_AU-wo_accents-only].
aspell-autobuildhash: processing: en [en_CA-variant_0].
aspell-autobuildhash: processing: en [en_CA-variant_1].
aspell-autobuildhash: processing: en [en_CA-w_accents-only].
aspell-autobuildhash: processing: en [en_CA-wo_accents-only].
aspell-autobuildhash: processing: en [en_GB-ise-w_accents-only].
aspell-autobuildhash: processing: en [en_GB-ise-wo_accents-only].
aspell-autobuildhash: processing: en [en_GB-ize-w_accents-only].
aspell-autobuildhash: processing: en [en_GB-ize-wo_accents-only].
aspell-autobuildhash: processing: en [en_GB-variant_0].
aspell-autobuildhash: processing: en [en_GB-variant_1].
aspell-autobuildhash: processing: en [en_US-w_accents-only].
aspell-autobuildhash: processing: en [en_US-wo_accents-only].
Processing triggers for dbus (1.12.2-1ubuntu1) ...
Processing triggers for libgdk-pixbuf2.0-0:amd64 (2.36.11-2) ...
(Reading database ... 80176 files and directories currently installed.)
Removing autopkgtest-satdep (0) ...
autopkgtest [19:37:06]: test boot-and-services: [-----------------------
bash: line 1: 13436 Killed                  /tmp/autopkgtest.FuucPI/build.pPY/systemd/debian/tests/boot-and-services 2> >(tee -a /tmp/autopkgtest.FuucPI/boot-and-services-stderr >&2) > >(tee -a /tmp/autopkgtest.FuucPI/boot-and-services-stdout)
autopkgtest [19:37:07]: test process requested reboot with marker boot1
Exit request sent.
autopkgtest-virt-ssh: WARNING: ssh connection failed. Retrying in 3 seconds...
autopkgtest-virt-ssh: WARNING: ssh connection failed. Retrying in 3 seconds...
test_profile (__main__.AppArmorTest)
AppArmor confined unit ... Replacement succeeded for "violator-test".

        
Release:bionic
Architecture:i386
Env:['CFLAGS=-O0', 'DEB_BUILD_PROFILES=noudeb', 'TEST_UPSTREAM=1', 'UPSTREAM_PULL_REQUEST=10853', 'GITHUB_STATUSES_URL=https://api.github.com/repos/systemd/systemd/statuses/bb25977244aedd73016778c75d4a7ad7d26c7009']
Ppas:['pitti/systemd-semaphore']
Build-git:https://salsa.debian.org/systemd-team/systemd.git
Running for:3h 31m 35s

Creating config file /etc/gdm3/greeter.dconf-defaults with new version
gdm.service is not active, cannot reload.
invoke-rc.d: initscript gdm3, action "reload" failed.
Setting up autopkgtest-satdep (0) ...
Processing triggers for libc-bin (2.27-3ubuntu1) ...
Processing triggers for systemd (239-2560-gbb2597724-0) ...
Processing triggers for dictionaries-common (1.27.2) ...
aspell-autobuildhash: processing: en [en-common].
aspell-autobuildhash: processing: en [en-variant_0].
aspell-autobuildhash: processing: en [en-variant_1].
aspell-autobuildhash: processing: en [en-variant_2].
aspell-autobuildhash: processing: en [en-w_accents-only].
aspell-autobuildhash: processing: en [en-wo_accents-only].
aspell-autobuildhash: processing: en [en_AU-variant_0].
aspell-autobuildhash: processing: en [en_AU-variant_1].
aspell-autobuildhash: processing: en [en_AU-w_accents-only].
aspell-autobuildhash: processing: en [en_AU-wo_accents-only].
aspell-autobuildhash: processing: en [en_CA-variant_0].
aspell-autobuildhash: processing: en [en_CA-variant_1].
aspell-autobuildhash: processing: en [en_CA-w_accents-only].
aspell-autobuildhash: processing: en [en_CA-wo_accents-only].
aspell-autobuildhash: processing: en [en_GB-ise-w_accents-only].
aspell-autobuildhash: processing: en [en_GB-ise-wo_accents-only].
aspell-autobuildhash: processing: en [en_GB-ize-w_accents-only].
aspell-autobuildhash: processing: en [en_GB-ize-wo_accents-only].
aspell-autobuildhash: processing: en [en_GB-variant_0].
aspell-autobuildhash: processing: en [en_GB-variant_1].
aspell-autobuildhash: processing: en [en_US-w_accents-only].
aspell-autobuildhash: processing: en [en_US-wo_accents-only].
Processing triggers for dbus (1.12.2-1ubuntu1) ...
Processing triggers for libgdk-pixbuf2.0-0:i386 (2.36.11-2) ...
(Reading database ... 82627 files and directories currently installed.)
Removing autopkgtest-satdep (0) ...

        

xen-tools

Release:cosmic
Architecture:arm64
Triggers:['openssh/1:7.7p1-4ubuntu0.1']
Running for:0h 37m 35s
Unpacking libterm-ui-perl (0.46-1) ...
Selecting previously unselected package libtext-template-perl.
Preparing to unpack .../16-libtext-template-perl_1.53-1_all.deb ...
Unpacking libtext-template-perl (1.53-1) ...
Selecting previously unselected package xen-tools.
Preparing to unpack .../17-xen-tools_4.7-1_all.deb ...
Unpacking xen-tools (4.7-1) ...
Selecting previously unselected package adequate.
Preparing to unpack .../18-adequate_0.15.1ubuntu5_all.deb ...
Unpacking adequate (0.15.1ubuntu5) ...
Setting up libnet-netmask-perl (1.9022-1) ...
Setting up libnet-domain-tld-perl (1.75-1) ...
Setting up libfile-slurp-perl (9999.19-6) ...
Setting up libconfig-inifiles-perl (2.98-1) ...
Setting up libfile-which-perl (1.22-1) ...
Setting up libnetwork-ipv4addr-perl (0.10.ds-3) ...
Processing triggers for initramfs-tools (0.131ubuntu15) ...
update-initramfs: Generating /boot/initrd.img-4.18.0-11-generic
Unsupported platform on EFI system, doing nothing.
Setting up libsort-versions-perl (1.62-1) ...
Setting up libnetaddr-ip-perl (4.079+dfsg-1build2) ...
Setting up liblog-message-perl (0.8-1) ...
Processing triggers for man-db (2.8.4-2) ...
Setting up adequate (0.15.1ubuntu5) ...
Setting up debootstrap (1.0.108ubuntu1.1) ...
Setting up libtext-template-perl (1.53-1) ...
Setting up libdata-validate-domain-perl (0.10-1) ...
Setting up libnet-ipv6addr-perl (0.2.dfsg.1-3) ...
Setting up libdata-validate-ip-perl (0.27-1) ...
Setting up libdata-validate-uri-perl (0.07-1) ...
Setting up liblog-message-simple-perl (0.10-3) ...
Setting up libterm-ui-perl (0.46-1) ...
Setting up xen-tools (4.7-1) ...
Processing triggers for initramfs-tools (0.131ubuntu15) ...
update-initramfs: Generating /boot/initrd.img-4.18.0-11-generic
Unsupported platform on EFI system, doing nothing.
Setting up autopkgtest-satdep (0) ...
(Reading database ... 98248 files and directories currently installed.)
Removing autopkgtest-satdep (0) ...

        

Queued tests for upstream bionic arm64

systemd-upstream {"build-git": "https://salsa.debian.org/systemd-team/systemd.git", "env": ["CFLAGS=-O0", "DEB_BUILD_PROFILES=noudeb", "TEST_UPSTREAM=1", "UPSTREAM_PULL_REQUEST=10858", "GITHUB_STATUSES_URL=https://api.github.com/repos/systemd/systemd/statuses/bd0ce2447d4e8be510e605699f866605274d6c71"], "ppas": ["pitti/systemd-semaphore"]}
systemd-upstream {"build-git": "https://salsa.debian.org/systemd-team/systemd.git", "env": ["CFLAGS=-O0", "DEB_BUILD_PROFILES=noudeb", "TEST_UPSTREAM=1", "UPSTREAM_PULL_REQUEST=10857", "GITHUB_STATUSES_URL=https://api.github.com/repos/systemd/systemd/statuses/ab84ad956e965b497998e9775f2b204d2bbc254f"], "ppas": ["pitti/systemd-semaphore"]}
systemd-upstream {"build-git": "https://salsa.debian.org/systemd-team/systemd.git", "env": ["CFLAGS=-O0", "DEB_BUILD_PROFILES=noudeb", "TEST_UPSTREAM=1", "UPSTREAM_PULL_REQUEST=10857", "GITHUB_STATUSES_URL=https://api.github.com/repos/systemd/systemd/statuses/93de583ad68b4ee9311cff16f5b9bb4f190095e2"], "ppas": ["pitti/systemd-semaphore"]}
systemd-upstream {"build-git": "https://salsa.debian.org/systemd-team/systemd.git", "env": ["CFLAGS=-O0", "DEB_BUILD_PROFILES=noudeb", "TEST_UPSTREAM=1", "UPSTREAM_PULL_REQUEST=10853", "GITHUB_STATUSES_URL=https://api.github.com/repos/systemd/systemd/statuses/bb25977244aedd73016778c75d4a7ad7d26c7009"], "ppas": ["pitti/systemd-semaphore"]}
systemd-upstream {"build-git": "https://salsa.debian.org/systemd-team/systemd.git", "env": ["CFLAGS=-O0", "DEB_BUILD_PROFILES=noudeb", "TEST_UPSTREAM=1", "UPSTREAM_PULL_REQUEST=10860", "GITHUB_STATUSES_URL=https://api.github.com/repos/systemd/systemd/statuses/806cc8d62d34ed852bfa187a0a10a09befff38d3"], "ppas": ["pitti/systemd-semaphore"]}
systemd-upstream {"build-git": "https://salsa.debian.org/systemd-team/systemd.git", "env": ["CFLAGS=-O0", "DEB_BUILD_PROFILES=noudeb", "TEST_UPSTREAM=1", "UPSTREAM_PULL_REQUEST=10797", "GITHUB_STATUSES_URL=https://api.github.com/repos/systemd/systemd/statuses/6fda261d9fed6b49a780e9a9dbdb61ec782496be"], "ppas": ["pitti/systemd-semaphore"]}
systemd-upstream {"build-git": "https://salsa.debian.org/systemd-team/systemd.git", "env": ["CFLAGS=-O0", "DEB_BUILD_PROFILES=noudeb", "TEST_UPSTREAM=1", "UPSTREAM_PULL_REQUEST=10857", "GITHUB_STATUSES_URL=https://api.github.com/repos/systemd/systemd/statuses/7ec726ace63a19f1ee460a1ef651444a1554c49d"], "ppas": ["pitti/systemd-semaphore"]}
systemd-upstream {"build-git": "https://salsa.debian.org/systemd-team/systemd.git", "env": ["CFLAGS=-O0", "DEB_BUILD_PROFILES=noudeb", "TEST_UPSTREAM=1", "UPSTREAM_PULL_REQUEST=10860", "GITHUB_STATUSES_URL=https://api.github.com/repos/systemd/systemd/statuses/2e34ce14a17478883fa29c7e330ad0828db72e97"], "ppas": ["pitti/systemd-semaphore"]}
systemd-upstream {"build-git": "https://salsa.debian.org/systemd-team/systemd.git", "env": ["CFLAGS=-O0", "DEB_BUILD_PROFILES=noudeb", "TEST_UPSTREAM=1", "UPSTREAM_PULL_REQUEST=10861", "GITHUB_STATUSES_URL=https://api.github.com/repos/systemd/systemd/statuses/6fec0c3382512ba6a329f8685f40d11b0071bf47"], "ppas": ["pitti/systemd-semaphore"]}
systemd-upstream {"build-git": "https://salsa.debian.org/systemd-team/systemd.git", "env": ["CFLAGS=-O0", "DEB_BUILD_PROFILES=noudeb", "TEST_UPSTREAM=1", "UPSTREAM_PULL_REQUEST=10861", "GITHUB_STATUSES_URL=https://api.github.com/repos/systemd/systemd/statuses/24572c7e714f50c664ae948b609e04576cb4921d"], "ppas": ["pitti/systemd-semaphore"]}
systemd-upstream {"build-git": "https://salsa.debian.org/systemd-team/systemd.git", "env": ["CFLAGS=-O0", "DEB_BUILD_PROFILES=noudeb", "TEST_UPSTREAM=1", "UPSTREAM_PULL_REQUEST=10862", "GITHUB_STATUSES_URL=https://api.github.com/repos/systemd/systemd/statuses/33246ebd14bc2b562487c2534daaf64c48cf6689"], "ppas": ["pitti/systemd-semaphore"]}